Build #16 for Combinatorrent-0.3.2

[all reports]

Package Combinatorrent-0.3.2
Install DependencyFailed network-bytestring-0.1.1.2
Docs NotTried
Tests NotTried
Time submitted 2016-10-24 14:55:07.873411 UTC
Compiler ghc-8.0.1.20160701
OS linux
Arch x86_64
Dependencies HTTP-4000.3.3, HUnit-1.5.0.0, PSQueue-1.1, QuickCheck-2.9.2, array-0.5.1.1, attoparsec-0.13.1.0, base-4.9.0.0, bytestring-0.10.8.1, cereal-0.5.3.0, containers-0.5.7.1, deepseq-1.4.2.0, directory-1.2.6.2, filepath-1.4.1.0, hopenssl-1.7, hslogger-1.2.10, mtl-2.2.1, network-2.6.3.1, network-bytestring-0.1.1.2, parsec-3.1.11, pretty-1.1.3.3, random-1.1, random-shuffle-0.0.4, stm-2.4.4.1, test-framework-0.8.1.1, test-framework-hunit-0.3.0.2, test-framework-quickcheck2-0.3.0.3, time-1.6.0.1
Flags -threadscope -debug

Build log

[view raw]

Resolving dependencies...
cabal: Entering directory '/tmp/cabal-tmp-10191/PSQueue-1.1'
Configuring PSQueue-1.1...
Building PSQueue-1.1...
Preprocessing library PSQueue-1.1...
[1 of 1] Compiling Data.PSQueue     ( Data/PSQueue.hs, dist/build/Data/PSQueue.o )
Running Haddock for PSQueue-1.1...
Running hscolour for PSQueue-1.1...
Preprocessing library PSQueue-1.1...
Preprocessing library PSQueue-1.1...
Haddock coverage:
  98% ( 40 / 41) in 'Data.PSQueue'
  Missing documentation for:
    empty (Data/PSQueue.hs:129)
Documentation created: dist/doc/html/PSQueue/index.html,
dist/doc/html/PSQueue/PSQueue.txt
Creating package registration file:
/tmp/pkgConf-PSQueue-12145174067468703135.1
Installing library in
/home/builder/hackage-server/build-cache/tmp-install/lib/x86_64-linux-ghc-8.0.1.20160701/PSQueue-1.1-DNpDWrWkOL4BwO0e9gII0d
Registering PSQueue-1.1...
cabal: Leaving directory '/tmp/cabal-tmp-10191/PSQueue-1.1'
Installed PSQueue-1.1
cabal: Entering directory '/tmp/cabal-tmp-10191/ansi-terminal-0.6.2.3'
Configuring ansi-terminal-0.6.2.3...
Building ansi-terminal-0.6.2.3...
Preprocessing library ansi-terminal-0.6.2.3...
[1 of 3] Compiling System.Console.ANSI.Common ( System/Console/ANSI/Common.hs, dist/build/System/Console/ANSI/Common.o )
[2 of 3] Compiling System.Console.ANSI.Unix ( System/Console/ANSI/Unix.hs, dist/build/System/Console/ANSI/Unix.o )
[3 of 3] Compiling System.Console.ANSI ( System/Console/ANSI.hs, dist/build/System/Console/ANSI.o )
Running Haddock for ansi-terminal-0.6.2.3...
Running hscolour for ansi-terminal-0.6.2.3...
Preprocessing library ansi-terminal-0.6.2.3...
Preprocessing library ansi-terminal-0.6.2.3...
Haddock coverage:
  88% (  7 /  8) in 'System.Console.ANSI.Common'
  Missing documentation for:
    Module header
  38% ( 30 / 79) in 'System.Console.ANSI.Unix'
  Missing documentation for:
    Module header
    cursorUp (includes/Common-Include.hs:9)
    cursorDown (includes/Common-Include.hs:9)
    cursorForward (includes/Common-Include.hs:9)
    cursorBackward (includes/Common-Include.hs:9)
    hCursorUp (includes/Common-Include.hs:6)
    hCursorDown (includes/Common-Include.hs:6)
    hCursorForward (includes/Common-Include.hs:6)
    hCursorBackward (includes/Common-Include.hs:6)
    cursorUpCode (includes/Common-Include.hs:11)
    cursorDownCode (includes/Common-Include.hs:11)
    cursorForwardCode (includes/Common-Include.hs:11)
    cursorBackwardCode (includes/Common-Include.hs:11)
    cursorUpLine (includes/Common-Include.hs:23)
    cursorDownLine (includes/Common-Include.hs:23)
    hCursorUpLine (includes/Common-Include.hs:20)
    hCursorDownLine (includes/Common-Include.hs:20)
    cursorUpLineCode (includes/Common-Include.hs:25)
    cursorDownLineCode (includes/Common-Include.hs:25)
    setCursorColumn (includes/Common-Include.hs:35)
    hSetCursorColumn (includes/Common-Include.hs:32)
    setCursorColumnCode (includes/Common-Include.hs:37)
    setCursorPosition (includes/Common-Include.hs:47)
    hSetCursorPosition (includes/Common-Include.hs:43)
    setCursorPositionCode (includes/Common-Include.hs:50)
    clearFromCursorToScreenEnd (includes/Common-Include.hs:59)
    clearFromCursorToScreenBeginning (includes/Common-Include.hs:59)
    clearScreen (includes/Common-Include.hs:59)
    hClearFromCursorToScreenEnd (includes/Common-Include.hs:57)
    hClearFromCursorToScreenBeginning (includes/Common-Include.hs:57)
    hClearScreen (includes/Common-Include.hs:57)
    clearFromCursorToScreenEndCode (includes/Common-Include.hs:60)
    clearFromCursorToScreenBeginningCode (includes/Common-Include.hs:60)
    clearScreenCode (includes/Common-Include.hs:60)
    clearFromCursorToLineEnd (includes/Common-Include.hs:69)
    clearFromCursorToLineBeginning (includes/Common-Include.hs:69)
    clearLine (includes/Common-Include.hs:69)
    hClearFromCursorToLineEnd (includes/Common-Include.hs:67)
    hClearFromCursorToLineBeginning (includes/Common-Include.hs:67)
    hClearLine (includes/Common-Include.hs:67)
    clearFromCursorToLineEndCode (includes/Common-Include.hs:70)
    clearFromCursorToLineBeginningCode (includes/Common-Include.hs:70)
    clearLineCode (includes/Common-Include.hs:70)
    hideCursor (includes/Common-Include.hs:114)
    showCursor (includes/Common-Include.hs:114)
    hHideCursor (includes/Common-Include.hs:112)
    hShowCursor (includes/Common-Include.hs:112)
    hideCursorCode (includes/Common-Include.hs:115)
    showCursorCode (includes/Common-Include.hs:115)
  39% ( 31 / 79) in 'System.Console.ANSI'
  Missing documentation for:
    cursorUp (includes/Common-Include.hs:9)
    cursorDown (includes/Common-Include.hs:9)
    cursorForward (includes/Common-Include.hs:9)
    cursorBackward (includes/Common-Include.hs:9)
    hCursorUp (includes/Common-Include.hs:6)
    hCursorDown (includes/Common-Include.hs:6)
    hCursorForward (includes/Common-Include.hs:6)
    hCursorBackward (includes/Common-Include.hs:6)
    cursorUpCode (includes/Common-Include.hs:11)
    cursorDownCode (includes/Common-Include.hs:11)
    cursorForwardCode (includes/Common-Include.hs:11)
    cursorBackwardCode (includes/Common-Include.hs:11)
    cursorUpLine (includes/Common-Include.hs:23)
    cursorDownLine (includes/Common-Include.hs:23)
    hCursorUpLine (includes/Common-Include.hs:20)
    hCursorDownLine (includes/Common-Include.hs:20)
    cursorUpLineCode (includes/Common-Include.hs:25)
    cursorDownLineCode (includes/Common-Include.hs:25)
    setCursorColumn (includes/Common-Include.hs:35)
    hSetCursorColumn (includes/Common-Include.hs:32)
    setCursorColumnCode (includes/Common-Include.hs:37)
    setCursorPosition (includes/Common-Include.hs:47)
    hSetCursorPosition (includes/Common-Include.hs:43)
    setCursorPositionCode (includes/Common-Include.hs:50)
    clearFromCursorToScreenEnd (includes/Common-Include.hs:59)
    clearFromCursorToScreenBeginning (includes/Common-Include.hs:59)
    clearScreen (includes/Common-Include.hs:59)
    hClearFromCursorToScreenEnd (includes/Common-Include.hs:57)
    hClearFromCursorToScreenBeginning (includes/Common-Include.hs:57)
    hClearScreen (includes/Common-Include.hs:57)
    clearFromCursorToScreenEndCode (includes/Common-Include.hs:60)
    clearFromCursorToScreenBeginningCode (includes/Common-Include.hs:60)
    clearScreenCode (includes/Common-Include.hs:60)
    clearFromCursorToLineEnd (includes/Common-Include.hs:69)
    clearFromCursorToLineBeginning (includes/Common-Include.hs:69)
    clearLine (includes/Common-Include.hs:69)
    hClearFromCursorToLineEnd (includes/Common-Include.hs:67)
    hClearFromCursorToLineBeginning (includes/Common-Include.hs:67)
    hClearLine (includes/Common-Include.hs:67)
    clearFromCursorToLineEndCode (includes/Common-Include.hs:70)
    clearFromCursorToLineBeginningCode (includes/Common-Include.hs:70)
    clearLineCode (includes/Common-Include.hs:70)
    hideCursor (includes/Common-Include.hs:114)
    showCursor (includes/Common-Include.hs:114)
    hHideCursor (includes/Common-Include.hs:112)
    hShowCursor (includes/Common-Include.hs:112)
    hideCursorCode (includes/Common-Include.hs:115)
    showCursorCode (includes/Common-Include.hs:115)
Warning: System.Console.ANSI: could not find link destinations for:
    unsafeIndex unsafeRangeSize
Documentation created: dist/doc/html/ansi-terminal/index.html,
dist/doc/html/ansi-terminal/ansi-terminal.txt
Creating package registration file:
/tmp/pkgConf-ansi-terminal-0.6.29439477391984210012.3
Installing library in
/home/builder/hackage-server/build-cache/tmp-install/lib/x86_64-linux-ghc-8.0.1.20160701/ansi-terminal-0.6.2.3-AKTYR0nthhUCHW4HMZvJFX
Registering ansi-terminal-0.6.2.3...
cabal: Leaving directory '/tmp/cabal-tmp-10191/ansi-terminal-0.6.2.3'
Installed ansi-terminal-0.6.2.3
cabal: Entering directory '/tmp/cabal-tmp-10191/call-stack-0.1.0'
Configuring call-stack-0.1.0...
Building call-stack-0.1.0...
Preprocessing library call-stack-0.1.0...
[1 of 3] Compiling Paths_call_stack ( dist/build/autogen/Paths_call_stack.hs, dist/build/Paths_call_stack.o )
[2 of 3] Compiling Data.SrcLoc      ( src/Data/SrcLoc.hs, dist/build/Data/SrcLoc.o )
[3 of 3] Compiling Data.CallStack   ( src/Data/CallStack.hs, dist/build/Data/CallStack.o )
Running Haddock for call-stack-0.1.0...
Running hscolour for call-stack-0.1.0...
Preprocessing library call-stack-0.1.0...
Preprocessing library call-stack-0.1.0...
Haddock coverage:
   0% (  0 /  8) in 'Paths_call_stack'
  Missing documentation for:
    Module header
    version (dist/build/autogen/Paths_call_stack.hs:28)
    getBinDir (dist/build/autogen/Paths_call_stack.hs:38)
    getLibDir (dist/build/autogen/Paths_call_stack.hs:38)
    getDataDir (dist/build/autogen/Paths_call_stack.hs:38)
    getLibexecDir (dist/build/autogen/Paths_call_stack.hs:38)
    getDataFileName (dist/build/autogen/Paths_call_stack.hs:45)
    getSysconfDir (dist/build/autogen/Paths_call_stack.hs:38)
  50% (  1 /  2) in 'Data.SrcLoc'
  Missing documentation for:
    Module header
  40% (  2 /  5) in 'Data.CallStack'
  Missing documentation for:
    Module header
    CallStack (src/Data/CallStack.hs:28)
    callStack (src/Data/CallStack.hs:30)
Documentation created: dist/doc/html/call-stack/index.html,
dist/doc/html/call-stack/call-stack.txt
Creating package registration file:
/tmp/pkgConf-call-stack-0.189369871982275856.0
Installing library in
/home/builder/hackage-server/build-cache/tmp-install/lib/x86_64-linux-ghc-8.0.1.20160701/call-stack-0.1.0-izRGIczcaH64KMRs1Wg8q
Registering call-stack-0.1.0...
cabal: Leaving directory '/tmp/cabal-tmp-10191/call-stack-0.1.0'
Installed call-stack-0.1.0
cabal: Entering directory '/tmp/cabal-tmp-10191/cereal-0.5.3.0'
Configuring cereal-0.5.3.0...
Building cereal-0.5.3.0...
Preprocessing library cereal-0.5.3.0...
[1 of 4] Compiling Data.Serialize.Put ( src/Data/Serialize/Put.hs, dist/build/Data/Serialize/Put.o )
[2 of 4] Compiling Data.Serialize.Get ( src/Data/Serialize/Get.hs, dist/build/Data/Serialize/Get.o )
[3 of 4] Compiling Data.Serialize.IEEE754 ( src/Data/Serialize/IEEE754.hs, dist/build/Data/Serialize/IEEE754.o )
[4 of 4] Compiling Data.Serialize   ( src/Data/Serialize.hs, dist/build/Data/Serialize.o )
Running Haddock for cereal-0.5.3.0...
Running hscolour for cereal-0.5.3.0...
Preprocessing library cereal-0.5.3.0...
Preprocessing library cereal-0.5.3.0...
Haddock coverage:
  68% ( 30 / 44) in 'Data.Serialize.Put'
  Missing documentation for:
    Putter (src/Data/Serialize/Put.hs:134)
    putBuilder (src/Data/Serialize/Put.hs:182)
    putShortByteString (src/Data/Serialize/Put.hs:231)
    putTwoOf (src/Data/Serialize/Put.hs:311)
    putListOf (src/Data/Serialize/Put.hs:315)
    putIArrayOf (src/Data/Serialize/Put.hs:321)
    putSeqOf (src/Data/Serialize/Put.hs:327)
    putTreeOf (src/Data/Serialize/Put.hs:333)
    putMapOf (src/Data/Serialize/Put.hs:340)
    putIntMapOf (src/Data/Serialize/Put.hs:344)
    putSetOf (src/Data/Serialize/Put.hs:348)
    putIntSetOf (src/Data/Serialize/Put.hs:352)
    putMaybeOf (src/Data/Serialize/Put.hs:356)
    putEitherOf (src/Data/Serialize/Put.hs:361)
  94% ( 60 / 64) in 'Data.Serialize.Get'
  Missing documentation for:
    label (src/Data/Serialize/Get.hs:272)
    getLazyByteString (src/Data/Serialize/Get.hs:510)
    getShortByteString (src/Data/Serialize/Get.hs:515)
    getTwoOf (src/Data/Serialize/Get.hs:754)
 100% ( 11 / 11) in 'Data.Serialize.IEEE754'
Cannot find documentation for: $example
  87% ( 13 / 15) in 'Data.Serialize'
  Missing documentation for:
    GSerializePut (src/Data/Serialize.hs:550)
    GSerializeGet (src/Data/Serialize.hs:553)
Warning: Data.Serialize.Put: could not find link destinations for:
    PairS
Warning: Data.Serialize.Get: could not find link destinations for:
    get
Warning: Data.Serialize: could not find link destinations for:
    PutSum SumSize GetSum
Documentation created: dist/doc/html/cereal/index.html,
dist/doc/html/cereal/cereal.txt
Creating package registration file:
/tmp/pkgConf-cereal-0.5.314472676051369321801.0
Installing library in
/home/builder/hackage-server/build-cache/tmp-install/lib/x86_64-linux-ghc-8.0.1.20160701/cereal-0.5.3.0-90KodwwwQanJlL7equBhpB
Registering cereal-0.5.3.0...
cabal: Leaving directory '/tmp/cabal-tmp-10191/cereal-0.5.3.0'
Installed cereal-0.5.3.0
cabal: Entering directory '/tmp/cabal-tmp-10191/extensible-exceptions-0.1.1.4'
Configuring extensible-exceptions-0.1.1.4...
Building extensible-exceptions-0.1.1.4...
Preprocessing library extensible-exceptions-0.1.1.4...
[1 of 1] Compiling Control.Exception.Extensible ( Control/Exception/Extensible.hs, dist/build/Control/Exception/Extensible.o )
Running Haddock for extensible-exceptions-0.1.1.4...
Running hscolour for extensible-exceptions-0.1.1.4...
Preprocessing library extensible-exceptions-0.1.1.4...
Preprocessing library extensible-exceptions-0.1.1.4...
Haddock coverage:
 100% (  2 /  2) in 'Control.Exception.Extensible'
Documentation created: dist/doc/html/extensible-exceptions/index.html,
dist/doc/html/extensible-exceptions/extensible-exceptions.txt
Creating package registration file:
/tmp/pkgConf-extensible-exceptions-0.1.1711645630195740084.4
Installing library in
/home/builder/hackage-server/build-cache/tmp-install/lib/x86_64-linux-ghc-8.0.1.20160701/extensible-exceptions-0.1.1.4-3h0ykvvAO915cRhUyj3rRV
Registering extensible-exceptions-0.1.1.4...
cabal: Leaving directory '/tmp/cabal-tmp-10191/extensible-exceptions-0.1.1.4'
Installed extensible-exceptions-0.1.1.4
cabal: Entering directory '/tmp/cabal-tmp-10191/hostname-1.0'
Configuring hostname-1.0...
Building hostname-1.0...
Preprocessing library hostname-1.0...
[1 of 1] Compiling Network.HostName ( Network/HostName.hs, dist/build/Network/HostName.o )
Running Haddock for hostname-1.0...
Running hscolour for hostname-1.0...
Preprocessing library hostname-1.0...
Preprocessing library hostname-1.0...
Haddock coverage:
   0% (  0 /  3) in 'Network.HostName'
  Missing documentation for:
    Module header
    HostName (Network/HostName.hs:48)
    getHostName (Network/HostName.hs:40)
Documentation created: dist/doc/html/hostname/index.html,
dist/doc/html/hostname/hostname.txt
Creating package registration file:
/tmp/pkgConf-hostname-113291321331280321648.0
Installing library in
/home/builder/hackage-server/build-cache/tmp-install/lib/x86_64-linux-ghc-8.0.1.20160701/hostname-1.0-42Ipmmd3lMbCN35rV9k5gh
Registering hostname-1.0...
cabal: Leaving directory '/tmp/cabal-tmp-10191/hostname-1.0'
Installed hostname-1.0
cabal: Entering directory '/tmp/cabal-tmp-10191/mtl-2.2.1'
Configuring mtl-2.2.1...
Building mtl-2.2.1...
Preprocessing library mtl-2.2.1...
[ 1 of 22] Compiling Control.Monad.Writer.Class ( Control/Monad/Writer/Class.hs, dist/build/Control/Monad/Writer/Class.o )
[ 2 of 22] Compiling Control.Monad.State.Class ( Control/Monad/State/Class.hs, dist/build/Control/Monad/State/Class.o )
[ 3 of 22] Compiling Control.Monad.Reader.Class ( Control/Monad/Reader/Class.hs, dist/build/Control/Monad/Reader/Class.o )
[ 4 of 22] Compiling Control.Monad.RWS.Class ( Control/Monad/RWS/Class.hs, dist/build/Control/Monad/RWS/Class.o )
[ 5 of 22] Compiling Control.Monad.Identity ( Control/Monad/Identity.hs, dist/build/Control/Monad/Identity.o )
[ 6 of 22] Compiling Control.Monad.Error.Class ( Control/Monad/Error/Class.hs, dist/build/Control/Monad/Error/Class.o )
[ 7 of 22] Compiling Control.Monad.Cont.Class ( Control/Monad/Cont/Class.hs, dist/build/Control/Monad/Cont/Class.o )
[ 8 of 22] Compiling Control.Monad.Trans ( Control/Monad/Trans.hs, dist/build/Control/Monad/Trans.o )
[ 9 of 22] Compiling Control.Monad.Error ( Control/Monad/Error.hs, dist/build/Control/Monad/Error.o )
[10 of 22] Compiling Control.Monad.Except ( Control/Monad/Except.hs, dist/build/Control/Monad/Except.o )
[11 of 22] Compiling Control.Monad.List ( Control/Monad/List.hs, dist/build/Control/Monad/List.o )
[12 of 22] Compiling Control.Monad.RWS.Lazy ( Control/Monad/RWS/Lazy.hs, dist/build/Control/Monad/RWS/Lazy.o )
[13 of 22] Compiling Control.Monad.RWS ( Control/Monad/RWS.hs, dist/build/Control/Monad/RWS.o )
[14 of 22] Compiling Control.Monad.Reader ( Control/Monad/Reader.hs, dist/build/Control/Monad/Reader.o )
[15 of 22] Compiling Control.Monad.RWS.Strict ( Control/Monad/RWS/Strict.hs, dist/build/Control/Monad/RWS/Strict.o )
[16 of 22] Compiling Control.Monad.State.Lazy ( Control/Monad/State/Lazy.hs, dist/build/Control/Monad/State/Lazy.o )
[17 of 22] Compiling Control.Monad.State ( Control/Monad/State.hs, dist/build/Control/Monad/State.o )
[18 of 22] Compiling Control.Monad.State.Strict ( Control/Monad/State/Strict.hs, dist/build/Control/Monad/State/Strict.o )
[19 of 22] Compiling Control.Monad.Writer.Lazy ( Control/Monad/Writer/Lazy.hs, dist/build/Control/Monad/Writer/Lazy.o )
[20 of 22] Compiling Control.Monad.Writer ( Control/Monad/Writer.hs, dist/build/Control/Monad/Writer.o )
[21 of 22] Compiling Control.Monad.Writer.Strict ( Control/Monad/Writer/Strict.hs, dist/build/Control/Monad/Writer/Strict.o )
[22 of 22] Compiling Control.Monad.Cont ( Control/Monad/Cont.hs, dist/build/Control/Monad/Cont.o )
Running Haddock for mtl-2.2.1...
Running hscolour for mtl-2.2.1...
Preprocessing library mtl-2.2.1...
Preprocessing library mtl-2.2.1...
Haddock coverage:
  75% (  3 /  4) in 'Control.Monad.Writer.Class'
  Missing documentation for:
    MonadWriter (Control/Monad/Writer/Class.hs:62)
 100% (  5 /  5) in 'Control.Monad.State.Class'
 100% (  3 /  3) in 'Control.Monad.Reader.Class'
  80% (  4 /  5) in 'Control.Monad.RWS.Class'
  Missing documentation for:
    MonadRWS (Control/Monad/RWS/Class.hs:44)
 100% (  4 /  4) in 'Control.Monad.Identity'
 100% (  3 /  3) in 'Control.Monad.Error.Class'
  50% (  1 /  2) in 'Control.Monad.Cont.Class'
  Missing documentation for:
    MonadCont (Control/Monad/Cont/Class.hs:73)
 100% (  3 /  3) in 'Control.Monad.Trans'
  93% ( 14 / 15) in 'Control.Monad.Error'
  Missing documentation for:
    runErrorT
 100% ( 19 / 19) in 'Control.Monad.Except'
 100% (  5 /  5) in 'Control.Monad.List'
  95% ( 21 / 22) in 'Control.Monad.RWS.Lazy'
  Missing documentation for:
    runRWST
 100% (  2 /  2) in 'Control.Monad.RWS'
  96% ( 22 / 23) in 'Control.Monad.Reader'
  Missing documentation for:
    runReaderT
  95% ( 21 / 22) in 'Control.Monad.RWS.Strict'
  Missing documentation for:
    runRWST
  96% ( 24 / 25) in 'Control.Monad.State.Lazy'
  Missing documentation for:
    runStateT
 100% (  2 /  2) in 'Control.Monad.State'
  96% ( 24 / 25) in 'Control.Monad.State.Strict'
  Missing documentation for:
    runStateT
  89% ( 17 / 19) in 'Control.Monad.Writer.Lazy'
  Missing documentation for:
    MonadWriter (Control/Monad/Writer/Class.hs:62)
    runWriterT
 100% (  2 /  2) in 'Control.Monad.Writer'
  94% ( 17 / 18) in 'Control.Monad.Writer.Strict'
  Missing documentation for:
    MonadWriter (Control/Monad/Writer/Class.hs:62)
  91% ( 20 / 22) in 'Control.Monad.Cont'
  Missing documentation for:
    MonadCont (Control/Monad/Cont/Class.hs:73)
    runContT
Documentation created: dist/doc/html/mtl/index.html, dist/doc/html/mtl/mtl.txt
Creating package registration file: /tmp/pkgConf-mtl-2.21364953431472576335.1
Installing library in
/home/builder/hackage-server/build-cache/tmp-install/lib/x86_64-linux-ghc-8.0.1.20160701/mtl-2.2.1-6qsR1PHUy5lL47Hpoa4jCM
Registering mtl-2.2.1...
cabal: Leaving directory '/tmp/cabal-tmp-10191/mtl-2.2.1'
Installed mtl-2.2.1
cabal: Entering directory '/tmp/cabal-tmp-10191/network-2.6.3.1'
Configuring network-2.6.3.1...
configure: WARNING: unrecognized options: --with-compiler
checking build system type... x86_64-unknown-linux-gnu
checking host system type... x86_64-unknown-linux-gnu
checking for gcc... /usr/bin/gcc
checking whether the C compiler works... yes
checking for C compiler default output file name... a.out
checking for suffix of executables... 
checking whether we are cross compiling... no
checking for suffix of object files... o
checking whether we are using the GNU C compiler... yes
checking whether /usr/bin/gcc accepts -g... yes
checking for /usr/bin/gcc option to accept ISO C89... none needed
checking for an ANSI C-conforming const... yes
checking how to run the C preprocessor... /usr/bin/gcc -E
checking for grep that handles long lines and -e... /bin/grep
checking for egrep... /bin/grep -E
checking for ANSI C header files... yes
checking for sys/types.h... yes
checking for sys/stat.h... yes
checking for stdlib.h... yes
checking for string.h... yes
checking for memory.h... yes
checking for strings.h... yes
checking for inttypes.h... yes
checking for stdint.h... yes
checking for unistd.h... yes
checking fcntl.h usability... yes
checking fcntl.h presence... yes
checking for fcntl.h... yes
checking limits.h usability... yes
checking limits.h presence... yes
checking for limits.h... yes
checking for stdlib.h... (cached) yes
checking for sys/types.h... (cached) yes
checking for unistd.h... (cached) yes
checking winsock2.h usability... no
checking winsock2.h presence... no
checking for winsock2.h... no
checking ws2tcpip.h usability... no
checking ws2tcpip.h presence... no
checking for ws2tcpip.h... no
checking arpa/inet.h usability... yes
checking arpa/inet.h presence... yes
checking for arpa/inet.h... yes
checking netdb.h usability... yes
checking netdb.h presence... yes
checking for netdb.h... yes
checking netinet/in.h usability... yes
checking netinet/in.h presence... yes
checking for netinet/in.h... yes
checking netinet/tcp.h usability... yes
checking netinet/tcp.h presence... yes
checking for netinet/tcp.h... yes
checking sys/socket.h usability... yes
checking sys/socket.h presence... yes
checking for sys/socket.h... yes
checking sys/uio.h usability... yes
checking sys/uio.h presence... yes
checking for sys/uio.h... yes
checking sys/un.h usability... yes
checking sys/un.h presence... yes
checking for sys/un.h... yes
checking linux/can.h usability... yes
checking linux/can.h presence... yes
checking for linux/can.h... yes
checking linux/tcp.h usability... yes
checking linux/tcp.h presence... yes
checking for linux/tcp.h... yes
checking net/if.h usability... yes
checking net/if.h presence... yes
checking for net/if.h... yes
checking for readlink... yes
checking for symlink... yes
checking for if_nametoindex... yes
checking for struct msghdr.msg_control... yes
checking for struct msghdr.msg_accrights... no
checking for struct sockaddr.sa_len... no
checking for in_addr_t in netinet/in.h... yes
checking for SO_PEERCRED and struct ucred in sys/socket.h... yes
checking for getpeereid in unistd.h... checking for getpeereid... no
checking for _head_libws2_32_a in -lws2_32... no
checking for getaddrinfo... yes
checking for gai_strerror... yes
checking whether AI_ADDRCONFIG is declared... yes
checking whether AI_ALL is declared... yes
checking whether AI_NUMERICSERV is declared... yes
checking whether AI_V4MAPPED is declared... yes
checking whether IPV6_V6ONLY is declared... yes
checking whether IPPROTO_IP is declared... yes
checking whether IPPROTO_TCP is declared... yes
checking whether IPPROTO_IPV6 is declared... yes
checking for sendfile in sys/sendfile.h... yes
checking for sendfile in sys/socket.h... no
checking for gethostent... yes
checking for accept4... yes
configure: creating ./config.status
config.status: creating network.buildinfo
config.status: creating include/HsNetworkConfig.h
config.status: include/HsNetworkConfig.h is unchanged
configure: WARNING: unrecognized options: --with-compiler
Building network-2.6.3.1...
Preprocessing library network-2.6.3.1...
[ 1 of 11] Compiling Network.Socket.ByteString.IOVec ( dist/build/Network/Socket/ByteString/IOVec.hs, dist/build/Network/Socket/ByteString/IOVec.o )
[ 2 of 11] Compiling Network.Socket.Types ( dist/build/Network/Socket/Types.hs, dist/build/Network/Socket/Types.o )
[ 3 of 11] Compiling Network.Socket.Internal ( dist/build/Network/Socket/Internal.hs, dist/build/Network/Socket/Internal.o )
[ 4 of 11] Compiling Network.Socket   ( dist/build/Network/Socket.hs, dist/build/Network/Socket.o )
[ 5 of 11] Compiling Network.Socket.ByteString.MsgHdr ( dist/build/Network/Socket/ByteString/MsgHdr.hs, dist/build/Network/Socket/ByteString/MsgHdr.o )
[ 6 of 11] Compiling Network.Socket.ByteString.Internal ( Network/Socket/ByteString/Internal.hs, dist/build/Network/Socket/ByteString/Internal.o )
[ 7 of 11] Compiling Network.Socket.ByteString ( dist/build/Network/Socket/ByteString.hs, dist/build/Network/Socket/ByteString.o )
[ 8 of 11] Compiling Network.Socket.ByteString.Lazy.Posix ( Network/Socket/ByteString/Lazy/Posix.hs, dist/build/Network/Socket/ByteString/Lazy/Posix.o )
[ 9 of 11] Compiling Network.Socket.ByteString.Lazy ( Network/Socket/ByteString/Lazy.hs, dist/build/Network/Socket/ByteString/Lazy.o )
[10 of 11] Compiling Network.BSD      ( dist/build/Network/BSD.hs, dist/build/Network/BSD.o )
[11 of 11] Compiling Network          ( Network.hs, dist/build/Network.o )
Running Haddock for network-2.6.3.1...
Running hscolour for network-2.6.3.1...
Preprocessing library network-2.6.3.1...
Preprocessing library network-2.6.3.1...
Haddock coverage:
  50% (  1 /  2) in 'Network.Socket.ByteString.IOVec'
  Missing documentation for:
    IOVec (Network/Socket/ByteString/IOVec.hsc:15)
  66% ( 29 / 44) in 'Network.Socket.Types'
  Missing documentation for:
    Module header
    sockFd (Network/Socket/Types.hsc:95)
    sockFamily (Network/Socket/Types.hsc:98)
    sockType (Network/Socket/Types.hsc:101)
    sockProtocol (Network/Socket/Types.hsc:104)
    sockStatus (Network/Socket/Types.hsc:107)
    packSocketType (Network/Socket/Types.hsc:192)
    unpackSocketType (Network/Socket/Types.hsc:207)
    packFamily (Network/Socket/Types.hsc:311)
    unpackFamily (Network/Socket/Types.hsc:527)
    hostAddress6ToTuple (Network/Socket/Types.hsc:1028)
    tupleToHostAddress6 (Network/Socket/Types.hsc:1036)
    FlowInfo (Network/Socket/Types.hsc:815)
    ScopeID (Network/Socket/Types.hsc:816)
    ProtocolNumber (Network/Socket/Types.hsc:117)
  94% ( 30 / 32) in 'Network.Socket.Internal'
  Missing documentation for:
    FlowInfo (Network/Socket/Types.hsc:815)
    ScopeID (Network/Socket/Types.hsc:816)
  72% ( 76 /105) in 'Network.Socket'
  Missing documentation for:
    hostAddress6ToTuple (Network/Socket/Types.hsc:1028)
    tupleToHostAddress6 (Network/Socket/Types.hsc:1036)
    FlowInfo (Network/Socket/Types.hsc:815)
    ScopeID (Network/Socket/Types.hsc:816)
    ShutdownCmd (Network/Socket.hsc:1069)
    ProtocolNumber (Network/Socket/Types.hsc:117)
    ServiceName (Network/Socket.hsc:234)
    AddrInfo (Network/Socket.hsc:1280)
    getPeerName (Network/Socket.hsc:774)
    getSocketName (Network/Socket.hsc:782)
    socketPort (Network/Socket.hsc:751)
    recvLen (Network/Socket.hsc:704)
    inet_addr (Network/Socket.hsc:1151)
    inet_ntoa (Network/Socket.hsc:1159)
    isBound (Network/Socket.hsc:1118)
    isListening (Network/Socket.hsc:1123)
    isReadable (Network/Socket.hsc:1128)
    isWritable (Network/Socket.hsc:1133)
    sendFd (Network/Socket.hsc:1008)
    recvFd (Network/Socket.hsc:1016)
    aNY_PORT (Network/Socket.hsc:1030)
    sOMAXCONN (Network/Socket.hsc:1050)
    sOL_SOCKET (Network/Socket.hsc:1053)
    sCM_RIGHTS (Network/Socket.hsc:1057)
    fdSocket (Network/Socket.hsc:277)
    mkSocket (Network/Socket.hsc:265)
    packFamily (Network/Socket/Types.hsc:311)
    unpackFamily (Network/Socket/Types.hsc:527)
    packSocketType (Network/Socket/Types.hsc:192)
  50% (  1 /  2) in 'Network.Socket.ByteString.MsgHdr'
  Missing documentation for:
    MsgHdr (Network/Socket/ByteString/MsgHdr.hsc:22)
  25% (  1 /  4) in 'Network.Socket.ByteString.Internal'
  Missing documentation for:
    mkInvalidRecvArgError (Network/Socket/ByteString/Internal.hs:34)
    c_writev (Network/Socket/ByteString/Internal.hs:40)
    c_sendmsg (Network/Socket/ByteString/Internal.hs:43)
 100% ( 15 / 15) in 'Network.Socket.ByteString'
  25% (  1 /  4) in 'Network.Socket.ByteString.Lazy.Posix'
  Missing documentation for:
    Module header
    send (Network/Socket/ByteString/Lazy/Posix.hs:27)
    sendAll (Network/Socket/ByteString/Lazy/Posix.hs:50)
  71% (  5 /  7) in 'Network.Socket.ByteString.Lazy'
  Missing documentation for:
    send (Network/Socket/ByteString/Lazy/Posix.hs:27)
    sendAll (Network/Socket/ByteString/Lazy/Posix.hs:50)
  44% ( 23 / 52) in 'Network.BSD'
  Missing documentation for:
    HostEntry (Network/BSD.hsc:329)
    hostAddress (Network/BSD.hsc:366)
    getHostEntries (Network/BSD.hsc:419)
    setHostEntry (Network/BSD.hsc:409)
    getHostEntry (Network/BSD.hsc:401)
    endHostEntry (Network/BSD.hsc:414)
    ServiceEntry (Network/BSD.hsc:139)
    ServiceName (Network/Socket.hsc:234)
    getServiceEntries (Network/BSD.hsc:224)
    getServiceEntry (Network/BSD.hsc:206)
    setServiceEntry (Network/BSD.hsc:214)
    endServiceEntry (Network/BSD.hsc:219)
    ProtocolName (Network/BSD.hsc:123)
    ProtocolNumber (Network/Socket/Types.hsc:117)
    ProtocolEntry (Network/BSD.hsc:242)
    getProtocolByName (Network/BSD.hsc:275)
    getProtocolByNumber (Network/BSD.hsc:286)
    getProtocolNumber (Network/BSD.hsc:296)
    getProtocolEntries (Network/BSD.hsc:320)
    setProtocolEntry (Network/BSD.hsc:310)
    getProtocolEntry (Network/BSD.hsc:302)
    endProtocolEntry (Network/BSD.hsc:315)
    NetworkName (Network/BSD.hsc:434)
    NetworkAddr (Network/BSD.hsc:432)
    NetworkEntry (Network/BSD.hsc:436)
    getNetworkByName (Network/BSD.hsc:467)
    getNetworkByAddr (Network/BSD.hsc:477)
    getNetworkEntry (Network/BSD.hsc:486)
    ifNameToIndex (Network/BSD.hsc:521)
  88% ( 22 / 25) in 'Network'
  Missing documentation for:
    PortID (Network.hs:81)
    sendTo (Network.hs:338)
    recvFrom (Network.hs:347)
Warning: Network.Socket.ByteString: could not find link destinations for:
    IOVec
Documentation created: dist/doc/html/network/index.html,
dist/doc/html/network/network.txt
Creating package registration file:
/tmp/pkgConf-network-2.6.32070262721691449122.1
Installing library in
/home/builder/hackage-server/build-cache/tmp-install/lib/x86_64-linux-ghc-8.0.1.20160701/network-2.6.3.1-G4Up1CPKbp7DeFsnywOnGG
Registering network-2.6.3.1...
cabal: Leaving directory '/tmp/cabal-tmp-10191/network-2.6.3.1'
Installed network-2.6.3.1
cabal: Entering directory '/tmp/cabal-tmp-10191/old-locale-1.0.0.7'
Configuring old-locale-1.0.0.7...
Building old-locale-1.0.0.7...
Preprocessing library old-locale-1.0.0.7...
[1 of 1] Compiling System.Locale    ( System/Locale.hs, dist/build/System/Locale.o )
Running Haddock for old-locale-1.0.0.7...
Running hscolour for old-locale-1.0.0.7...
Preprocessing library old-locale-1.0.0.7...
Preprocessing library old-locale-1.0.0.7...
Haddock coverage:
  60% (  3 /  5) in 'System.Locale'
  Missing documentation for:
    TimeLocale (System/Locale.hs:36)
    defaultTimeLocale (System/Locale.hs:49)
Documentation created: dist/doc/html/old-locale/index.html,
dist/doc/html/old-locale/old-locale.txt
Creating package registration file:
/tmp/pkgConf-old-locale-1.0.01799560997332238283.7
Installing library in
/home/builder/hackage-server/build-cache/tmp-install/lib/x86_64-linux-ghc-8.0.1.20160701/old-locale-1.0.0.7-6glXNhHF891B41ZfuI8hU8
Registering old-locale-1.0.0.7...
cabal: Leaving directory '/tmp/cabal-tmp-10191/old-locale-1.0.0.7'
Installed old-locale-1.0.0.7
cabal: Entering directory '/tmp/cabal-tmp-10191/primitive-0.6.1.0'
Configuring primitive-0.6.1.0...
Building primitive-0.6.1.0...
Preprocessing library primitive-0.6.1.0...
[ 1 of 10] Compiling Data.Primitive.Internal.Compat ( Data/Primitive/Internal/Compat.hs, dist/build/Data/Primitive/Internal/Compat.o )
[ 2 of 10] Compiling Data.Primitive.MachDeps ( Data/Primitive/MachDeps.hs, dist/build/Data/Primitive/MachDeps.o )
[ 3 of 10] Compiling Data.Primitive.Internal.Operations ( Data/Primitive/Internal/Operations.hs, dist/build/Data/Primitive/Internal/Operations.o )
[ 4 of 10] Compiling Control.Monad.Primitive ( Control/Monad/Primitive.hs, dist/build/Control/Monad/Primitive.o )

Control/Monad/Primitive.hs:41:1: warning: [-Wdeprecations]
    Module ‘Control.Monad.Trans.Error’ is deprecated:
      Use Control.Monad.Trans.Except instead

Control/Monad/Primitive.hs:100:11: warning: [-Wdeprecations]
    In the use of type constructor or class ‘Error’
    (imported from Control.Monad.Trans.Error):
    Deprecated: "Use Control.Monad.Trans.Except instead"

Control/Monad/Primitive.hs:100:47: warning: [-Wdeprecations]
    In the use of type constructor or class ‘ErrorT’
    (imported from Control.Monad.Trans.Error):
    Deprecated: "Use Control.Monad.Trans.Except instead"

Control/Monad/Primitive.hs:101:19: warning: [-Wdeprecations]
    In the use of type constructor or class ‘ErrorT’
    (imported from Control.Monad.Trans.Error):
    Deprecated: "Use Control.Monad.Trans.Except instead"
[ 5 of 10] Compiling Data.Primitive.Types ( Data/Primitive/Types.hs, dist/build/Data/Primitive/Types.o )
[ 6 of 10] Compiling Data.Primitive.Array ( Data/Primitive/Array.hs, dist/build/Data/Primitive/Array.o )
[ 7 of 10] Compiling Data.Primitive.ByteArray ( Data/Primitive/ByteArray.hs, dist/build/Data/Primitive/ByteArray.o )
[ 8 of 10] Compiling Data.Primitive.Addr ( Data/Primitive/Addr.hs, dist/build/Data/Primitive/Addr.o )
[ 9 of 10] Compiling Data.Primitive   ( Data/Primitive.hs, dist/build/Data/Primitive.o )
[10 of 10] Compiling Data.Primitive.MutVar ( Data/Primitive/MutVar.hs, dist/build/Data/Primitive/MutVar.o )
Running Haddock for primitive-0.6.1.0...
Running hscolour for primitive-0.6.1.0...
Preprocessing library primitive-0.6.1.0...
Preprocessing library primitive-0.6.1.0...

Control/Monad/Primitive.hs:41:1: warning: [-Wdeprecations]
    Module ‘Control.Monad.Trans.Error’ is deprecated:
      Use Control.Monad.Trans.Except instead

Control/Monad/Primitive.hs:100:11: warning: [-Wdeprecations]
    In the use of type constructor or class ‘Error’
    (imported from Control.Monad.Trans.Error):
    Deprecated: "Use Control.Monad.Trans.Except instead"

Control/Monad/Primitive.hs:100:47: warning: [-Wdeprecations]
    In the use of type constructor or class ‘ErrorT’
    (imported from Control.Monad.Trans.Error):
    Deprecated: "Use Control.Monad.Trans.Except instead"

Control/Monad/Primitive.hs:101:19: warning: [-Wdeprecations]
    In the use of type constructor or class ‘ErrorT’
    (imported from Control.Monad.Trans.Error):
    Deprecated: "Use Control.Monad.Trans.Except instead"
Haddock coverage:
 100% (  3 /  3) in 'Data.Primitive.Internal.Compat'
   3% (  1 / 35) in 'Data.Primitive.MachDeps'
  Missing documentation for:
    sIZEOF_CHAR (Data/Primitive/MachDeps.hs:19)
    aLIGNMENT_CHAR (Data/Primitive/MachDeps.hs:19)
    sIZEOF_INT (Data/Primitive/MachDeps.hs:19)
    aLIGNMENT_INT (Data/Primitive/MachDeps.hs:19)
    sIZEOF_WORD (Data/Primitive/MachDeps.hs:19)
    aLIGNMENT_WORD (Data/Primitive/MachDeps.hs:19)
    sIZEOF_DOUBLE (Data/Primitive/MachDeps.hs:19)
    aLIGNMENT_DOUBLE (Data/Primitive/MachDeps.hs:19)
    sIZEOF_FLOAT (Data/Primitive/MachDeps.hs:19)
    aLIGNMENT_FLOAT (Data/Primitive/MachDeps.hs:19)
    sIZEOF_PTR (Data/Primitive/MachDeps.hs:19)
    aLIGNMENT_PTR (Data/Primitive/MachDeps.hs:19)
    sIZEOF_FUNPTR (Data/Primitive/MachDeps.hs:19)
    aLIGNMENT_FUNPTR (Data/Primitive/MachDeps.hs:19)
    sIZEOF_STABLEPTR (Data/Primitive/MachDeps.hs:19)
    aLIGNMENT_STABLEPTR (Data/Primitive/MachDeps.hs:19)
    sIZEOF_INT8 (Data/Primitive/MachDeps.hs:19)
    aLIGNMENT_INT8 (Data/Primitive/MachDeps.hs:19)
    sIZEOF_WORD8 (Data/Primitive/MachDeps.hs:19)
    aLIGNMENT_WORD8 (Data/Primitive/MachDeps.hs:19)
    sIZEOF_INT16 (Data/Primitive/MachDeps.hs:19)
    aLIGNMENT_INT16 (Data/Primitive/MachDeps.hs:19)
    sIZEOF_WORD16 (Data/Primitive/MachDeps.hs:19)
    aLIGNMENT_WORD16 (Data/Primitive/MachDeps.hs:19)
    sIZEOF_INT32 (Data/Primitive/MachDeps.hs:19)
    aLIGNMENT_INT32 (Data/Primitive/MachDeps.hs:19)
    sIZEOF_WORD32 (Data/Primitive/MachDeps.hs:19)
    aLIGNMENT_WORD32 (Data/Primitive/MachDeps.hs:19)
    sIZEOF_INT64 (Data/Primitive/MachDeps.hs:19)
    aLIGNMENT_INT64 (Data/Primitive/MachDeps.hs:19)
    sIZEOF_WORD64 (Data/Primitive/MachDeps.hs:19)
    aLIGNMENT_WORD64 (Data/Primitive/MachDeps.hs:19)
    Word64_# (Data/Primitive/MachDeps.hs:120)
    Int64_# (Data/Primitive/MachDeps.hs:121)
   3% (  1 / 29) in 'Data.Primitive.Internal.Operations'
  Missing documentation for:
    setWord8Array# (Data/Primitive/Internal/Operations.hs:33)
    setWord16Array# (Data/Primitive/Internal/Operations.hs:35)
    setWord32Array# (Data/Primitive/Internal/Operations.hs:37)
    setWord64Array# (Data/Primitive/Internal/Operations.hs:39)
    setWordArray# (Data/Primitive/Internal/Operations.hs:41)
    setInt8Array# (Data/Primitive/Internal/Operations.hs:43)
    setInt16Array# (Data/Primitive/Internal/Operations.hs:45)
    setInt32Array# (Data/Primitive/Internal/Operations.hs:47)
    setInt64Array# (Data/Primitive/Internal/Operations.hs:49)
    setIntArray# (Data/Primitive/Internal/Operations.hs:51)
    setAddrArray# (Data/Primitive/Internal/Operations.hs:53)
    setFloatArray# (Data/Primitive/Internal/Operations.hs:55)
    setDoubleArray# (Data/Primitive/Internal/Operations.hs:57)
    setWideCharArray# (Data/Primitive/Internal/Operations.hs:59)
    setWord8OffAddr# (Data/Primitive/Internal/Operations.hs:62)
    setWord16OffAddr# (Data/Primitive/Internal/Operations.hs:64)
    setWord32OffAddr# (Data/Primitive/Internal/Operations.hs:66)
    setWord64OffAddr# (Data/Primitive/Internal/Operations.hs:68)
    setWordOffAddr# (Data/Primitive/Internal/Operations.hs:70)
    setInt8OffAddr# (Data/Primitive/Internal/Operations.hs:72)
    setInt16OffAddr# (Data/Primitive/Internal/Operations.hs:74)
    setInt32OffAddr# (Data/Primitive/Internal/Operations.hs:76)
    setInt64OffAddr# (Data/Primitive/Internal/Operations.hs:78)
    setIntOffAddr# (Data/Primitive/Internal/Operations.hs:80)
    setAddrOffAddr# (Data/Primitive/Internal/Operations.hs:82)
    setFloatOffAddr# (Data/Primitive/Internal/Operations.hs:84)
    setDoubleOffAddr# (Data/Primitive/Internal/Operations.hs:86)
    setWideCharOffAddr# (Data/Primitive/Internal/Operations.hs:88)
  75% ( 12 / 16) in 'Control.Monad.Primitive'
  Missing documentation for:
    unsafeInlinePrim (Control/Monad/Primitive.hs:189)
    unsafeInlineIO (Control/Monad/Primitive.hs:193)
    unsafeInlineST (Control/Monad/Primitive.hs:197)
    touch (Control/Monad/Primitive.hs:201)
 100% (  3 /  3) in 'Data.Primitive.Types'
 100% ( 15 / 15) in 'Data.Primitive.Array'
  93% ( 27 / 29) in 'Data.Primitive.ByteArray'
  Missing documentation for:
    ByteArray#
    MutableByteArray#
 100% ( 16 / 16) in 'Data.Primitive.Addr'
 100% (  7 /  7) in 'Data.Primitive'
 100% (  9 /  9) in 'Data.Primitive.MutVar'
Warning: Control.Monad.Primitive: could not find link destinations for:
    ~
Documentation created: dist/doc/html/primitive/index.html,
dist/doc/html/primitive/primitive.txt
Creating package registration file:
/tmp/pkgConf-primitive-0.6.1878273679987706141.0
Installing library in
/home/builder/hackage-server/build-cache/tmp-install/lib/x86_64-linux-ghc-8.0.1.20160701/primitive-0.6.1.0-Ip44DqhfCp21tTUYbecwa
Registering primitive-0.6.1.0...
cabal: Leaving directory '/tmp/cabal-tmp-10191/primitive-0.6.1.0'
Installed primitive-0.6.1.0
cabal: Entering directory '/tmp/cabal-tmp-10191/random-1.1'
Configuring random-1.1...
Building random-1.1...
Preprocessing library random-1.1...
[1 of 1] Compiling System.Random    ( System/Random.hs, dist/build/System/Random.o )

System/Random.hs:43:1: warning: [-Wtabs]
    Tab character found here, and in 74 further locations.
    Please use spaces instead.
Running Haddock for random-1.1...
Running hscolour for random-1.1...
Preprocessing library random-1.1...
Preprocessing library random-1.1...

System/Random.hs:43:1: warning: [-Wtabs]
    Tab character found here, and in 74 further locations.
    Please use spaces instead.
Haddock coverage:
Cannot find documentation for: $intro
 100% ( 16 / 16) in 'System.Random'
Documentation created: dist/doc/html/random/index.html,
dist/doc/html/random/random.txt
Creating package registration file:
/tmp/pkgConf-random-113672090951589513899.1
Installing library in
/home/builder/hackage-server/build-cache/tmp-install/lib/x86_64-linux-ghc-8.0.1.20160701/random-1.1-54KmMHXjttlERYcr1mvsAe
Registering random-1.1...
cabal: Leaving directory '/tmp/cabal-tmp-10191/random-1.1'
Installed random-1.1
cabal: Entering directory '/tmp/cabal-tmp-10191/stm-2.4.4.1'
Configuring stm-2.4.4.1...
Building stm-2.4.4.1...
Preprocessing library stm-2.4.4.1...
[ 1 of 10] Compiling Control.Sequential.STM ( Control/Sequential/STM.hs, dist/build/Control/Sequential/STM.o )
[ 2 of 10] Compiling Control.Concurrent.STM.TBQueue ( Control/Concurrent/STM/TBQueue.hs, dist/build/Control/Concurrent/STM/TBQueue.o )
[ 3 of 10] Compiling Control.Concurrent.STM.TQueue ( Control/Concurrent/STM/TQueue.hs, dist/build/Control/Concurrent/STM/TQueue.o )
[ 4 of 10] Compiling Control.Concurrent.STM.TChan ( Control/Concurrent/STM/TChan.hs, dist/build/Control/Concurrent/STM/TChan.o )
[ 5 of 10] Compiling Control.Concurrent.STM.TMVar ( Control/Concurrent/STM/TMVar.hs, dist/build/Control/Concurrent/STM/TMVar.o )
[ 6 of 10] Compiling Control.Concurrent.STM.TVar ( Control/Concurrent/STM/TVar.hs, dist/build/Control/Concurrent/STM/TVar.o )
[ 7 of 10] Compiling Control.Concurrent.STM.TArray ( Control/Concurrent/STM/TArray.hs, dist/build/Control/Concurrent/STM/TArray.o )
[ 8 of 10] Compiling Control.Monad.STM ( Control/Monad/STM.hs, dist/build/Control/Monad/STM.o )
[ 9 of 10] Compiling Control.Concurrent.STM ( Control/Concurrent/STM.hs, dist/build/Control/Concurrent/STM.o )
[10 of 10] Compiling Control.Concurrent.STM.TSem ( Control/Concurrent/STM/TSem.hs, dist/build/Control/Concurrent/STM/TSem.o )
Running Haddock for stm-2.4.4.1...
Running hscolour for stm-2.4.4.1...
Preprocessing library stm-2.4.4.1...
Preprocessing library stm-2.4.4.1...
Haddock coverage:
   0% (  0 / 11) in 'Control.Sequential.STM'
  Missing documentation for:
    Module header
    STM (Control/Sequential/STM.hs:29)
    atomically (Control/Sequential/STM.hs:47)
    throwSTM (Control/Sequential/STM.hs:54)
    catchSTM (Control/Sequential/STM.hs:57)
    TVar (Control/Sequential/STM.hs:72)
    newTVar (Control/Sequential/STM.hs:75)
    newTVarIO (Control/Sequential/STM.hs:78)
    readTVar (Control/Sequential/STM.hs:83)
    readTVarIO (Control/Sequential/STM.hs:86)
    writeTVar (Control/Sequential/STM.hs:89)
 100% ( 13 / 13) in 'Control.Concurrent.STM.TBQueue'
 100% ( 12 / 12) in 'Control.Concurrent.STM.TQueue'
 100% ( 18 / 18) in 'Control.Concurrent.STM.TChan'
 100% ( 16 / 16) in 'Control.Concurrent.STM.TMVar'
 100% ( 13 / 13) in 'Control.Concurrent.STM.TVar'
 100% (  2 /  2) in 'Control.Concurrent.STM.TArray'
  90% (  9 / 10) in 'Control.Monad.STM'
  Missing documentation for:
    check (Control/Monad/STM.hs:81)
 100% (  8 /  8) in 'Control.Concurrent.STM'
  40% (  2 /  5) in 'Control.Concurrent.STM.TSem'
  Missing documentation for:
    newTSem (Control/Concurrent/STM/TSem.hs:42)
    waitTSem (Control/Concurrent/STM/TSem.hs:45)
    signalTSem (Control/Concurrent/STM/TSem.hs:51)
Warning: Control.Concurrent.STM.TArray: could not find link destinations for:
    getNumElements unsafeNewArray_ unsafeRead unsafeWrite
Warning: Control.Monad.STM: could not find link destinations for:
    getNumElements unsafeNewArray_ unsafeRead unsafeWrite
Documentation created: dist/doc/html/stm/index.html, dist/doc/html/stm/stm.txt
Creating package registration file:
/tmp/pkgConf-stm-2.4.413905980891028363610.1
Installing library in
/home/builder/hackage-server/build-cache/tmp-install/lib/x86_64-linux-ghc-8.0.1.20160701/stm-2.4.4.1-4z2NRWnB0NIIUvSJsHW0kF
Registering stm-2.4.4.1...
cabal: Leaving directory '/tmp/cabal-tmp-10191/stm-2.4.4.1'
Installed stm-2.4.4.1
cabal: Entering directory '/tmp/cabal-tmp-10191/text-1.2.2.1'
Configuring text-1.2.2.1...
Building text-1.2.2.1...
Preprocessing library text-1.2.2.1...
[ 1 of 44] Compiling Data.Text.Internal.Read ( Data/Text/Internal/Read.hs, dist/build/Data/Text/Internal/Read.o )
[ 2 of 44] Compiling Data.Text.Internal.Encoding.Utf32 ( Data/Text/Internal/Encoding/Utf32.hs, dist/build/Data/Text/Internal/Encoding/Utf32.o )
[ 3 of 44] Compiling Data.Text.Internal.Builder.RealFloat.Functions ( Data/Text/Internal/Builder/RealFloat/Functions.hs, dist/build/Data/Text/Internal/Builder/RealFloat/Functions.o )
[ 4 of 44] Compiling Data.Text.Internal.Builder.Int.Digits ( Data/Text/Internal/Builder/Int/Digits.hs, dist/build/Data/Text/Internal/Builder/Int/Digits.o )
[ 5 of 44] Compiling Data.Text.Encoding.Error ( Data/Text/Encoding/Error.hs, dist/build/Data/Text/Encoding/Error.o )
[ 6 of 44] Compiling Data.Text.Internal.Unsafe.Shift ( Data/Text/Internal/Unsafe/Shift.hs, dist/build/Data/Text/Internal/Unsafe/Shift.o )
[ 7 of 44] Compiling Data.Text.Internal.Encoding.Utf16 ( Data/Text/Internal/Encoding/Utf16.hs, dist/build/Data/Text/Internal/Encoding/Utf16.o )
[ 8 of 44] Compiling Data.Text.Internal.Functions ( Data/Text/Internal/Functions.hs, dist/build/Data/Text/Internal/Functions.o )
[ 9 of 44] Compiling Data.Text.Internal.Unsafe ( Data/Text/Internal/Unsafe.hs, dist/build/Data/Text/Internal/Unsafe.o )
[10 of 44] Compiling Data.Text.Array  ( Data/Text/Array.hs, dist/build/Data/Text/Array.o )
[11 of 44] Compiling Data.Text.Internal.Unsafe.Char ( Data/Text/Internal/Unsafe/Char.hs, dist/build/Data/Text/Internal/Unsafe/Char.o )
[12 of 44] Compiling Data.Text.Internal ( Data/Text/Internal.hs, dist/build/Data/Text/Internal.o )
[13 of 44] Compiling Data.Text.Internal.Fusion.Size ( Data/Text/Internal/Fusion/Size.hs, dist/build/Data/Text/Internal/Fusion/Size.o )
[14 of 44] Compiling Data.Text.Internal.Fusion.Types ( Data/Text/Internal/Fusion/Types.hs, dist/build/Data/Text/Internal/Fusion/Types.o )
[15 of 44] Compiling Data.Text.Internal.Fusion.CaseMapping ( Data/Text/Internal/Fusion/CaseMapping.hs, dist/build/Data/Text/Internal/Fusion/CaseMapping.o )
[16 of 44] Compiling Data.Text.Internal.Fusion.Common ( Data/Text/Internal/Fusion/Common.hs, dist/build/Data/Text/Internal/Fusion/Common.o )
[17 of 44] Compiling Data.Text.Unsafe ( Data/Text/Unsafe.hs, dist/build/Data/Text/Unsafe.o )
[18 of 44] Compiling Data.Text.Internal.Private ( Data/Text/Internal/Private.hs, dist/build/Data/Text/Internal/Private.o )
[19 of 44] Compiling Data.Text.Internal.Fusion ( Data/Text/Internal/Fusion.hs, dist/build/Data/Text/Internal/Fusion.o )
[20 of 44] Compiling Data.Text.Show   ( Data/Text/Show.hs, dist/build/Data/Text/Show.o )
[21 of 44] Compiling Data.Text.Internal.Encoding.Fusion.Common ( Data/Text/Internal/Encoding/Fusion/Common.hs, dist/build/Data/Text/Internal/Encoding/Fusion/Common.o )
[22 of 44] Compiling Data.Text.Internal.Encoding.Utf8 ( Data/Text/Internal/Encoding/Utf8.hs, dist/build/Data/Text/Internal/Encoding/Utf8.o )
[23 of 44] Compiling Data.Text.Internal.Encoding.Fusion ( Data/Text/Internal/Encoding/Fusion.hs, dist/build/Data/Text/Internal/Encoding/Fusion.o )
[24 of 44] Compiling Data.Text.Encoding ( Data/Text/Encoding.hs, dist/build/Data/Text/Encoding.o )
[25 of 44] Compiling Data.Text.Internal.Lazy.Encoding.Fusion ( Data/Text/Internal/Lazy/Encoding/Fusion.hs, dist/build/Data/Text/Internal/Lazy/Encoding/Fusion.o )
[26 of 44] Compiling Data.Text.Internal.Search ( Data/Text/Internal/Search.hs, dist/build/Data/Text/Internal/Search.o )
[27 of 44] Compiling Data.Text.Foreign ( Data/Text/Foreign.hs, dist/build/Data/Text/Foreign.o )
[28 of 44] Compiling Data.Text        ( Data/Text.hs, dist/build/Data/Text.o )

Data/Text.hs:587:1: warning: [-Winline-rule-shadowing]
    Rule "TEXT compareN/length -> compareLength" may never fire
      because ‘length’ might inline first
    Probable fix: add an INLINE[n] or NOINLINE[n] pragma for ‘length’

Data/Text.hs:592:1: warning: [-Winline-rule-shadowing]
    Rule "TEXT ==N/length -> compareLength/==EQ" may never fire
      because ‘length’ might inline first
    Probable fix: add an INLINE[n] or NOINLINE[n] pragma for ‘length’

Data/Text.hs:597:1: warning: [-Winline-rule-shadowing]
    Rule "TEXT /=N/length -> compareLength//=EQ" may never fire
      because ‘length’ might inline first
    Probable fix: add an INLINE[n] or NOINLINE[n] pragma for ‘length’

Data/Text.hs:602:1: warning: [-Winline-rule-shadowing]
    Rule "TEXT <N/length -> compareLength/==LT" may never fire
      because ‘length’ might inline first
    Probable fix: add an INLINE[n] or NOINLINE[n] pragma for ‘length’

Data/Text.hs:607:1: warning: [-Winline-rule-shadowing]
    Rule "TEXT <=N/length -> compareLength//=GT" may never fire
      because ‘length’ might inline first
    Probable fix: add an INLINE[n] or NOINLINE[n] pragma for ‘length’

Data/Text.hs:612:1: warning: [-Winline-rule-shadowing]
    Rule "TEXT >N/length -> compareLength/==GT" may never fire
      because ‘length’ might inline first
    Probable fix: add an INLINE[n] or NOINLINE[n] pragma for ‘length’

Data/Text.hs:617:1: warning: [-Winline-rule-shadowing]
    Rule "TEXT >=N/length -> compareLength//=LT" may never fire
      because ‘length’ might inline first
    Probable fix: add an INLINE[n] or NOINLINE[n] pragma for ‘length’
[29 of 44] Compiling Data.Text.Internal.IO ( Data/Text/Internal/IO.hs, dist/build/Data/Text/Internal/IO.o )
[30 of 44] Compiling Data.Text.IO     ( Data/Text/IO.hs, dist/build/Data/Text/IO.o )
[31 of 44] Compiling Data.Text.Internal.Lazy ( Data/Text/Internal/Lazy.hs, dist/build/Data/Text/Internal/Lazy.o )
[32 of 44] Compiling Data.Text.Internal.Lazy.Fusion ( Data/Text/Internal/Lazy/Fusion.hs, dist/build/Data/Text/Internal/Lazy/Fusion.o )
[33 of 44] Compiling Data.Text.Internal.Lazy.Search ( Data/Text/Internal/Lazy/Search.hs, dist/build/Data/Text/Internal/Lazy/Search.o )
[34 of 44] Compiling Data.Text.Lazy.Internal ( Data/Text/Lazy/Internal.hs, dist/build/Data/Text/Lazy/Internal.o )
[35 of 44] Compiling Data.Text.Lazy.Encoding ( Data/Text/Lazy/Encoding.hs, dist/build/Data/Text/Lazy/Encoding.o )
[36 of 44] Compiling Data.Text.Lazy   ( Data/Text/Lazy.hs, dist/build/Data/Text/Lazy.o )
[37 of 44] Compiling Data.Text.Internal.Builder ( Data/Text/Internal/Builder.hs, dist/build/Data/Text/Internal/Builder.o )

Data/Text/Internal/Builder.hs:324:1: warning: [-Winline-rule-shadowing]
    Rule "flush/flush" may never fire
      because ‘flush’ might inline first
    Probable fix: add an INLINE[n] or NOINLINE[n] pragma for ‘flush’
[38 of 44] Compiling Data.Text.Lazy.Builder ( Data/Text/Lazy/Builder.hs, dist/build/Data/Text/Lazy/Builder.o )
[39 of 44] Compiling Data.Text.Internal.Builder.Functions ( Data/Text/Internal/Builder/Functions.hs, dist/build/Data/Text/Internal/Builder/Functions.o )
[40 of 44] Compiling Data.Text.Lazy.Builder.Int ( Data/Text/Lazy/Builder/Int.hs, dist/build/Data/Text/Lazy/Builder/Int.o )
[41 of 44] Compiling Data.Text.Lazy.IO ( Data/Text/Lazy/IO.hs, dist/build/Data/Text/Lazy/IO.o )
[42 of 44] Compiling Data.Text.Lazy.Read ( Data/Text/Lazy/Read.hs, dist/build/Data/Text/Lazy/Read.o )
[43 of 44] Compiling Data.Text.Lazy.Builder.RealFloat ( Data/Text/Lazy/Builder/RealFloat.hs, dist/build/Data/Text/Lazy/Builder/RealFloat.o )
[44 of 44] Compiling Data.Text.Read   ( Data/Text/Read.hs, dist/build/Data/Text/Read.o )
Running Haddock for text-1.2.2.1...
Running hscolour for text-1.2.2.1...
Preprocessing library text-1.2.2.1...
Preprocessing library text-1.2.2.1...
Haddock coverage:
  14% (  1 /  7) in 'Data.Text.Internal.Read'
  Missing documentation for:
    IReader (Data/Text/Internal/Read.hs:26)
    IParser (Data/Text/Internal/Read.hs:28)
    T (Data/Text/Internal/Read.hs:48)
    digitToInt (Data/Text/Internal/Read.hs:61)
    hexDigitToInt (Data/Text/Internal/Read.hs:55)
    perhaps (Data/Text/Internal/Read.hs:50)
  50% (  1 /  2) in 'Data.Text.Internal.Encoding.Utf32'
  Missing documentation for:
    validate (Data/Text/Internal/Encoding/Utf32.hs:24)
  50% (  1 /  2) in 'Data.Text.Internal.Builder.RealFloat.Functions'
  Missing documentation for:
    roundTo (Data/Text/Internal/Builder/RealFloat/Functions.hs:17)
   0% (  0 /  2) in 'Data.Text.Internal.Builder.Int.Digits'
  Missing documentation for:
    Module header
    digits (Data/Text/Internal/Builder/Int/Digits.hs:21)
 100% ( 12 / 12) in 'Data.Text.Encoding.Error'
 100% (  2 /  2) in 'Data.Text.Internal.Unsafe.Shift'
  25% (  1 /  4) in 'Data.Text.Internal.Encoding.Utf16'
  Missing documentation for:
    chr2 (Data/Text/Internal/Encoding/Utf16.hs:29)
    validate1 (Data/Text/Internal/Encoding/Utf16.hs:38)
    validate2 (Data/Text/Internal/Encoding/Utf16.hs:42)
 100% (  2 /  2) in 'Data.Text.Internal.Functions'
 100% (  3 /  3) in 'Data.Text.Internal.Unsafe'
 100% ( 16 / 16) in 'Data.Text.Array'
  33% (  2 /  6) in 'Data.Text.Internal.Unsafe.Char'
  Missing documentation for:
    ord (Data/Text/Internal/Unsafe/Char.hs:39)
    unsafeChr (Data/Text/Internal/Unsafe/Char.hs:43)
    unsafeChr8 (Data/Text/Internal/Unsafe/Char.hs:47)
    unsafeChr32 (Data/Text/Internal/Unsafe/Char.hs:51)
  95% ( 19 / 20) in 'Data.Text.Internal'
  Missing documentation for:
    textP (Data/Text/Internal.hs:97)
  38% (  5 / 13) in 'Data.Text.Internal.Fusion.Size'
  Missing documentation for:
    Size (Data/Text/Internal/Fusion/Size.hs:40)
    exactly (Data/Text/Internal/Fusion/Size.hs:44)
    exactSize (Data/Text/Internal/Fusion/Size.hs:49)
    maxSize (Data/Text/Internal/Fusion/Size.hs:57)
    betweenSize (Data/Text/Internal/Fusion/Size.hs:65)
    unknownSize (Data/Text/Internal/Fusion/Size.hs:74)
    compareSize (Data/Text/Internal/Fusion/Size.hs:143)
    isEmpty (Data/Text/Internal/Fusion/Size.hs:151)
  88% (  7 /  8) in 'Data.Text.Internal.Fusion.Types'
  Missing documentation for:
    Stream (Data/Text/Internal/Fusion/Types.hs:83)
   0% (  0 /  5) in 'Data.Text.Internal.Fusion.CaseMapping'
  Missing documentation for:
    Module header
    upperMapping (Data/Text/Internal/Fusion/CaseMapping.hs:13)
    lowerMapping (Data/Text/Internal/Fusion/CaseMapping.hs:220)
    titleMapping (Data/Text/Internal/Fusion/CaseMapping.hs:225)
    foldMapping (Data/Text/Internal/Fusion/CaseMapping.hs:324)
  89% ( 63 / 71) in 'Data.Text.Internal.Fusion.Common'
  Missing documentation for:
    singleton (Data/Text/Internal/Fusion/Common.hs:119)
    streamList (Data/Text/Internal/Fusion/Common.hs:125)
    unstreamList (Data/Text/Internal/Fusion/Common.hs:131)
    intercalate (Data/Text/Internal/Fusion/Common.hs:577)
    justifyLeftI (Data/Text/Internal/Fusion/Common.hs:479)
    scanl (Data/Text/Internal/Fusion/Common.hs:656)
    replicateCharI (Data/Text/Internal/Fusion/Common.hs:671)
    replicateI (Data/Text/Internal/Fusion/Common.hs:682)
  93% ( 13 / 14) in 'Data.Text.Unsafe'
  Missing documentation for:
    Iter (Data/Text/Unsafe.hs:62)
  33% (  1 /  3) in 'Data.Text.Internal.Private'
  Missing documentation for:
    runText (Data/Text/Internal/Private.hs:33)
    span_ (Data/Text/Internal/Private.hs:23)
  91% ( 20 / 22) in 'Data.Text.Internal.Fusion'
  Missing documentation for:
    Stream (Data/Text/Internal/Fusion/Types.hs:83)
    length (Data/Text/Internal/Fusion.hs:127)
 100% (  4 /  4) in 'Data.Text.Show'
  33% (  2 /  6) in 'Data.Text.Internal.Encoding.Fusion.Common'
  Missing documentation for:
    restreamUtf16LE (Data/Text/Internal/Encoding/Fusion/Common.hs:63)
    restreamUtf16BE (Data/Text/Internal/Encoding/Fusion/Common.hs:39)
    restreamUtf32LE (Data/Text/Internal/Encoding/Fusion/Common.hs:106)
    restreamUtf32BE (Data/Text/Internal/Encoding/Fusion/Common.hs:87)
  17% (  2 / 12) in 'Data.Text.Internal.Encoding.Utf8'
  Missing documentation for:
    ord2 (Data/Text/Internal/Encoding/Utf8.hs:58)
    ord3 (Data/Text/Internal/Encoding/Utf8.hs:69)
    ord4 (Data/Text/Internal/Encoding/Utf8.hs:81)
    chr2 (Data/Text/Internal/Encoding/Utf8.hs:94)
    chr3 (Data/Text/Internal/Encoding/Utf8.hs:103)
    chr4 (Data/Text/Internal/Encoding/Utf8.hs:114)
    validate1 (Data/Text/Internal/Encoding/Utf8.hs:128)
    validate2 (Data/Text/Internal/Encoding/Utf8.hs:132)
    validate3 (Data/Text/Internal/Encoding/Utf8.hs:136)
    validate4 (Data/Text/Internal/Encoding/Utf8.hs:153)
  91% ( 10 / 11) in 'Data.Text.Internal.Encoding.Fusion'
  Missing documentation for:
    streamASCII (Data/Text/Internal/Encoding/Fusion.hs:57)
 100% ( 33 / 33) in 'Data.Text.Encoding'
 100% ( 10 / 10) in 'Data.Text.Internal.Lazy.Encoding.Fusion'
 100% (  2 /  2) in 'Data.Text.Internal.Search'
 100% ( 18 / 18) in 'Data.Text.Foreign'
 100% (127 /127) in 'Data.Text'
 100% (  3 /  3) in 'Data.Text.Internal.IO'
 100% ( 20 / 20) in 'Data.Text.IO'
  93% ( 14 / 15) in 'Data.Text.Internal.Lazy'
  Missing documentation for:
    Text (Data/Text/Internal/Lazy.hs:47)
 100% (  8 /  8) in 'Data.Text.Internal.Lazy.Fusion'
 100% (  2 /  2) in 'Data.Text.Internal.Lazy.Search'
 100% (  2 /  2) in 'Data.Text.Lazy.Internal'
  89% ( 24 / 27) in 'Data.Text.Lazy.Encoding'
  Missing documentation for:
    encodeUtf8 (Data/Text/Lazy/Encoding.hs:148)
    encodeUtf8Builder (Data/Text/Lazy/Encoding.hs:162)
    encodeUtf8BuilderEscaped (Data/Text/Lazy/Encoding.hs:167)
  99% (128 /129) in 'Data.Text.Lazy'
  Missing documentation for:
    Text (Data/Text/Internal/Lazy.hs:47)
  94% ( 16 / 17) in 'Data.Text.Internal.Builder'
  Missing documentation for:
    append' (Data/Text/Internal/Builder.hs:301)
 100% ( 12 / 12) in 'Data.Text.Lazy.Builder'
 100% (  3 /  3) in 'Data.Text.Internal.Builder.Functions'
   0% (  0 /  3) in 'Data.Text.Lazy.Builder.Int'
  Missing documentation for:
    Module header
    decimal (Data/Text/Lazy/Builder/Int.hs:52)
    hexadecimal (Data/Text/Lazy/Builder/Int.hs:162)
 100% ( 19 / 19) in 'Data.Text.Lazy.IO'
 100% (  7 /  7) in 'Data.Text.Lazy.Read'
  75% (  3 /  4) in 'Data.Text.Lazy.Builder.RealFloat'
  Missing documentation for:
    formatRealFloat (Data/Text/Lazy/Builder/RealFloat.hs:46)
 100% (  7 /  7) in 'Data.Text.Read'
Warning: Data.Text.Internal.Fusion.Common: could not find link destinations for:
    findIndicesI
Warning: Data.Text: could not find link destinations for:
    replicateChar countChar
Warning: Data.Text.Internal.IO: could not find link destinations for:
    Handle__
Warning: Data.Text.Lazy: could not find link destinations for:
    replicateChar dropWords splitAtWord countChar
Warning: Data.Text.Internal.Builder: could not find link destinations for:
    empty append
Warning: Data.Text.Lazy.Builder.RealFloat: could not find link destinations for:
    floatToDigits
Documentation created: dist/doc/html/text/index.html,
dist/doc/html/text/text.txt
Creating package registration file:
/tmp/pkgConf-text-1.2.210917149371364180570.1
Installing library in
/home/builder/hackage-server/build-cache/tmp-install/lib/x86_64-linux-ghc-8.0.1.20160701/text-1.2.2.1-9Yh8rJoh8fO2JMLWffT3Qs
Registering text-1.2.2.1...
cabal: Leaving directory '/tmp/cabal-tmp-10191/text-1.2.2.1'
Installed text-1.2.2.1
cabal: Entering directory '/tmp/cabal-tmp-10191/transformers-compat-0.5.1.4'
Configuring transformers-compat-0.5.1.4...
Building transformers-compat-0.5.1.4...
Preprocessing library transformers-compat-0.5.1.4...
[1 of 2] Compiling Paths_transformers_compat ( dist/build/autogen/Paths_transformers_compat.hs, dist/build/Paths_transformers_compat.o )
[2 of 2] Compiling Control.Monad.Trans.Instances ( src/Control/Monad/Trans/Instances.hs, dist/build/Control/Monad/Trans/Instances.o )
Running Haddock for transformers-compat-0.5.1.4...
Running hscolour for transformers-compat-0.5.1.4...
Preprocessing library transformers-compat-0.5.1.4...
Preprocessing library transformers-compat-0.5.1.4...
Haddock coverage:
   0% (  0 /  8) in 'Paths_transformers_compat'
  Missing documentation for:
    Module header
    version (dist/build/autogen/Paths_transformers_compat.hs:28)
    getBinDir (dist/build/autogen/Paths_transformers_compat.hs:38)
    getLibDir (dist/build/autogen/Paths_transformers_compat.hs:38)
    getDataDir (dist/build/autogen/Paths_transformers_compat.hs:38)
    getLibexecDir (dist/build/autogen/Paths_transformers_compat.hs:38)
    getDataFileName (dist/build/autogen/Paths_transformers_compat.hs:45)
    getSysconfDir (dist/build/autogen/Paths_transformers_compat.hs:38)
 100% (  1 /  1) in 'Control.Monad.Trans.Instances'
Documentation created: dist/doc/html/transformers-compat/index.html,
dist/doc/html/transformers-compat/transformers-compat.txt
Creating package registration file:
/tmp/pkgConf-transformers-compat-0.5.12063762111270617569.4
Installing library in
/home/builder/hackage-server/build-cache/tmp-install/lib/x86_64-linux-ghc-8.0.1.20160701/transformers-compat-0.5.1.4-G5tKvPrwhggJRvSwXNMs1N
Registering transformers-compat-0.5.1.4...
cabal: Leaving directory '/tmp/cabal-tmp-10191/transformers-compat-0.5.1.4'
Installed transformers-compat-0.5.1.4
cabal: Entering directory '/tmp/cabal-tmp-10191/ansi-wl-pprint-0.6.7.3'
Configuring ansi-wl-pprint-0.6.7.3...
Building ansi-wl-pprint-0.6.7.3...
Preprocessing library ansi-wl-pprint-0.6.7.3...
[1 of 1] Compiling Text.PrettyPrint.ANSI.Leijen ( Text/PrettyPrint/ANSI/Leijen.hs, dist/build/Text/PrettyPrint/ANSI/Leijen.o )
Running Haddock for ansi-wl-pprint-0.6.7.3...
Running hscolour for ansi-wl-pprint-0.6.7.3...
Preprocessing library ansi-wl-pprint-0.6.7.3...
Preprocessing library ansi-wl-pprint-0.6.7.3...
Haddock coverage:
  96% (129 /134) in 'Text.PrettyPrint.ANSI.Leijen'
  Missing documentation for:
    bool (Text/PrettyPrint/ANSI/Leijen.hs:506)
    column (Text/PrettyPrint/ANSI/Leijen.hs:843)
    columns (Text/PrettyPrint/ANSI/Leijen.hs:847)
    nesting (Text/PrettyPrint/ANSI/Leijen.hs:843)
    width (Text/PrettyPrint/ANSI/Leijen.hs:646)
Documentation created: dist/doc/html/ansi-wl-pprint/index.html,
dist/doc/html/ansi-wl-pprint/ansi-wl-pprint.txt
Creating package registration file:
/tmp/pkgConf-ansi-wl-pprint-0.6.710843847951214790563.3
Installing library in
/home/builder/hackage-server/build-cache/tmp-install/lib/x86_64-linux-ghc-8.0.1.20160701/ansi-wl-pprint-0.6.7.3-EqhsHSbxOT2xFHZZJCFwf
Registering ansi-wl-pprint-0.6.7.3...
cabal: Leaving directory '/tmp/cabal-tmp-10191/ansi-wl-pprint-0.6.7.3'
Installed ansi-wl-pprint-0.6.7.3
cabal: Entering directory '/tmp/cabal-tmp-10191/HUnit-1.5.0.0'
Configuring HUnit-1.5.0.0...
Building HUnit-1.5.0.0...
Preprocessing library HUnit-1.5.0.0...
[1 of 6] Compiling Paths_HUnit      ( dist/build/autogen/Paths_HUnit.hs, dist/build/Paths_HUnit.o )
[2 of 6] Compiling Test.HUnit.Terminal ( src/Test/HUnit/Terminal.hs, dist/build/Test/HUnit/Terminal.o )
[3 of 6] Compiling Test.HUnit.Lang  ( src/Test/HUnit/Lang.hs, dist/build/Test/HUnit/Lang.o )
[4 of 6] Compiling Test.HUnit.Base  ( src/Test/HUnit/Base.hs, dist/build/Test/HUnit/Base.o )
[5 of 6] Compiling Test.HUnit.Text  ( src/Test/HUnit/Text.hs, dist/build/Test/HUnit/Text.o )
[6 of 6] Compiling Test.HUnit       ( src/Test/HUnit.hs, dist/build/Test/HUnit.o )
Running Haddock for HUnit-1.5.0.0...
Running hscolour for HUnit-1.5.0.0...
Preprocessing library HUnit-1.5.0.0...
Preprocessing library HUnit-1.5.0.0...
Haddock coverage:
   0% (  0 /  8) in 'Paths_HUnit'
  Missing documentation for:
    Module header
    version (dist/build/autogen/Paths_HUnit.hs:28)
    getBinDir (dist/build/autogen/Paths_HUnit.hs:38)
    getLibDir (dist/build/autogen/Paths_HUnit.hs:38)
    getDataDir (dist/build/autogen/Paths_HUnit.hs:38)
    getLibexecDir (dist/build/autogen/Paths_HUnit.hs:38)
    getDataFileName (dist/build/autogen/Paths_HUnit.hs:45)
    getSysconfDir (dist/build/autogen/Paths_HUnit.hs:38)
 100% (  2 /  2) in 'Test.HUnit.Terminal'
  55% (  6 / 11) in 'Test.HUnit.Lang'
  Missing documentation for:
    Module header
    Result (src/Test/HUnit/Lang.hs:86)
    HUnitFailure (src/Test/HUnit/Lang.hs:34)
    FailureReason (src/Test/HUnit/Lang.hs:39)
    formatFailureReason (src/Test/HUnit/Lang.hs:82)
 100% ( 33 / 33) in 'Test.HUnit.Base'
 100% (  8 /  8) in 'Test.HUnit.Text'
 100% (  3 /  3) in 'Test.HUnit'
Documentation created: dist/doc/html/HUnit/index.html,
dist/doc/html/HUnit/HUnit.txt
Creating package registration file:
/tmp/pkgConf-HUnit-1.5.013622434281101709878.0
Installing library in
/home/builder/hackage-server/build-cache/tmp-install/lib/x86_64-linux-ghc-8.0.1.20160701/HUnit-1.5.0.0-LmQy44w6E24IQ5C7bKO5Pw
Registering HUnit-1.5.0.0...
cabal: Leaving directory '/tmp/cabal-tmp-10191/HUnit-1.5.0.0'
Installed HUnit-1.5.0.0
cabal: Entering directory '/tmp/cabal-tmp-10191/hopenssl-1.7'
Configuring hopenssl-1.7...
Building hopenssl-1.7...
Preprocessing library hopenssl-1.7...
[1 of 3] Compiling OpenSSL.Digest   ( OpenSSL/Digest.hs, dist/build/OpenSSL/Digest.o )
[2 of 3] Compiling OpenSSL.Digest.ByteString ( OpenSSL/Digest/ByteString.hs, dist/build/OpenSSL/Digest/ByteString.o )
[3 of 3] Compiling OpenSSL.Digest.ByteString.Lazy ( OpenSSL/Digest/ByteString/Lazy.hs, dist/build/OpenSSL/Digest/ByteString/Lazy.o )
Running Haddock for hopenssl-1.7...
Running hscolour for hopenssl-1.7...
Preprocessing library hopenssl-1.7...
Preprocessing library hopenssl-1.7...
Haddock coverage:
  63% ( 24 / 38) in 'OpenSSL.Digest'
  Missing documentation for:
    Context (OpenSSL/Digest.hs:143)
    MDEngine (OpenSSL/Digest.hs:148)
    mdDSS (OpenSSL/Digest.hs:196)
    mdDSS1 (OpenSSL/Digest.hs:197)
    mdMD5 (OpenSSL/Digest.hs:198)
    mdNull (OpenSSL/Digest.hs:199)
    mdMDC2 (OpenSSL/Digest.hs:200)
    mdRIPEMD160 (OpenSSL/Digest.hs:201)
    mdSHA (OpenSSL/Digest.hs:202)
    mdSHA1 (OpenSSL/Digest.hs:203)
    mdSHA224 (OpenSSL/Digest.hs:204)
    mdSHA256 (OpenSSL/Digest.hs:205)
    mdSHA384 (OpenSSL/Digest.hs:206)
    mdSHA512 (OpenSSL/Digest.hs:207)
 100% (  3 /  3) in 'OpenSSL.Digest.ByteString'
 100% (  3 /  3) in 'OpenSSL.Digest.ByteString.Lazy'
Documentation created: dist/doc/html/hopenssl/index.html,
dist/doc/html/hopenssl/hopenssl.txt
Creating package registration file:
/tmp/pkgConf-hopenssl-1184070057371061648.7
Installing library in
/home/builder/hackage-server/build-cache/tmp-install/lib/x86_64-linux-ghc-8.0.1.20160701/hopenssl-1.7-1WI9blqJRd5B4Agd5FM8YY
Registering hopenssl-1.7...
cabal: Leaving directory '/tmp/cabal-tmp-10191/hopenssl-1.7'
Installed hopenssl-1.7
cabal: Entering directory '/tmp/cabal-tmp-10191/regex-base-0.93.2'
Configuring regex-base-0.93.2...
Building regex-base-0.93.2...
Preprocessing library regex-base-0.93.2...
[1 of 4] Compiling Text.Regex.Base.RegexLike ( Text/Regex/Base/RegexLike.hs, dist/build/Text/Regex/Base/RegexLike.o )
[2 of 4] Compiling Text.Regex.Base.Context ( Text/Regex/Base/Context.hs, dist/build/Text/Regex/Base/Context.o )
[3 of 4] Compiling Text.Regex.Base  ( Text/Regex/Base.hs, dist/build/Text/Regex/Base.o )

Text/Regex/Base.hs:55:13: warning: [-Wdeprecations]
    In the use of ‘versionTags’ (imported from Data.Version):
    Deprecated: "See GHC ticket #2496"
[4 of 4] Compiling Text.Regex.Base.Impl ( Text/Regex/Base/Impl.hs, dist/build/Text/Regex/Base/Impl.o )
Running Haddock for regex-base-0.93.2...
Running hscolour for regex-base-0.93.2...
Preprocessing library regex-base-0.93.2...
Preprocessing library regex-base-0.93.2...

Text/Regex/Base.hs:55:13: warning: [-Wdeprecations]
    In the use of ‘versionTags’ (imported from Data.Version):
    Deprecated: "See GHC ticket #2496"
Haddock coverage:
  94% ( 17 / 18) in 'Text.Regex.Base.RegexLike'
  Missing documentation for:
    MatchText (Text/Regex/Base/RegexLike.hs:55)
 100% (  1 /  1) in 'Text.Regex.Base.Context'
  75% (  3 /  4) in 'Text.Regex.Base'
  Missing documentation for:
    getVersion_Text_Regex_Base (Text/Regex/Base.hs:52)
  33% (  1 /  3) in 'Text.Regex.Base.Impl'
  Missing documentation for:
    polymatch (Text/Regex/Base/Impl.hs:50)
    polymatchM (Text/Regex/Base/Impl.hs:56)
Documentation created: dist/doc/html/regex-base/index.html,
dist/doc/html/regex-base/regex-base.txt
Creating package registration file:
/tmp/pkgConf-regex-base-0.9312095976981200977805.2
Installing library in
/home/builder/hackage-server/build-cache/tmp-install/lib/x86_64-linux-ghc-8.0.1.20160701/regex-base-0.93.2-71isvdwnRNrGKtKYo9rpQd
Registering regex-base-0.93.2...
cabal: Leaving directory '/tmp/cabal-tmp-10191/regex-base-0.93.2'
Installed regex-base-0.93.2
cabal: Entering directory '/tmp/cabal-tmp-10191/hslogger-1.2.10'
Configuring hslogger-1.2.10...
Building hslogger-1.2.10...
Preprocessing library hslogger-1.2.10...
[1 of 8] Compiling System.Log       ( src/System/Log.hs, dist/build/System/Log.o )
[2 of 8] Compiling System.Log.Formatter ( src/System/Log/Formatter.hs, dist/build/System/Log/Formatter.o )
[3 of 8] Compiling System.Log.Handler ( src/System/Log/Handler.hs, dist/build/System/Log/Handler.o )
[4 of 8] Compiling System.Log.Handler.Simple ( src/System/Log/Handler/Simple.hs, dist/build/System/Log/Handler/Simple.o )
[5 of 8] Compiling System.Log.Handler.Syslog ( src/System/Log/Handler/Syslog.hs, dist/build/System/Log/Handler/Syslog.o )

src/System/Log/Handler/Syslog.hs:198:16: warning: [-Wdeprecations]
    In the use of ‘sClose’ (imported from Network.Socket):
    Deprecated: "use 'close'"

src/System/Log/Handler/Syslog.hs:260:33: warning: [-Wdeprecations]
    In the use of ‘sendTo’ (imported from Network.Socket):
    "Use sendTo defined in "Network.Socket.ByteString""

src/System/Log/Handler/Syslog.hs:261:33: warning: [-Wdeprecations]
    In the use of ‘send’ (imported from Network.Socket):
    "Use send defined in "Network.Socket.ByteString""

src/System/Log/Handler/Syslog.hs:278:16: warning: [-Wdeprecations]
    In the use of ‘sClose’ (imported from Network.Socket):
    Deprecated: "use 'close'"
[6 of 8] Compiling System.Log.Handler.Growl ( src/System/Log/Handler/Growl.hs, dist/build/System/Log/Handler/Growl.o )

src/System/Log/Handler/Growl.hs:47:59: warning: [-Wdeprecations]
    In the use of ‘sClose’ (imported from Network.Socket):
    Deprecated: "use 'close'"

src/System/Log/Handler/Growl.hs:50:21: warning: [-Wdeprecations]
    In the use of ‘sendTo’ (imported from Network.Socket):
    "Use sendTo defined in "Network.Socket.ByteString""

src/System/Log/Handler/Growl.hs:109:32: warning: [-Wdeprecations]
    In the use of ‘sendTo’ (imported from Network.Socket):
    "Use sendTo defined in "Network.Socket.ByteString""
[7 of 8] Compiling System.Log.Handler.Log4jXML ( src/System/Log/Handler/Log4jXML.hs, dist/build/System/Log/Handler/Log4jXML.o )
[8 of 8] Compiling System.Log.Logger ( src/System/Log/Logger.hs, dist/build/System/Log/Logger.o )

src/System/Log/Logger.hs:201:1: warning: [-Wdeprecations]
    Module ‘Control.Monad.Error’ is deprecated:
      Use Control.Monad.Except instead
Running Haddock for hslogger-1.2.10...
Running hscolour for hslogger-1.2.10...
Preprocessing library hslogger-1.2.10...
Preprocessing library hslogger-1.2.10...

src/System/Log/Handler/Syslog.hs:198:16: warning: [-Wdeprecations]
    In the use of ‘sClose’ (imported from Network.Socket):
    Deprecated: "use 'close'"

src/System/Log/Handler/Syslog.hs:260:33: warning: [-Wdeprecations]
    In the use of ‘sendTo’ (imported from Network.Socket):
    "Use sendTo defined in "Network.Socket.ByteString""

src/System/Log/Handler/Syslog.hs:261:33: warning: [-Wdeprecations]
    In the use of ‘send’ (imported from Network.Socket):
    "Use send defined in "Network.Socket.ByteString""

src/System/Log/Handler/Syslog.hs:278:16: warning: [-Wdeprecations]
    In the use of ‘sClose’ (imported from Network.Socket):
    Deprecated: "use 'close'"

src/System/Log/Handler/Growl.hs:47:59: warning: [-Wdeprecations]
    In the use of ‘sClose’ (imported from Network.Socket):
    Deprecated: "use 'close'"

src/System/Log/Handler/Growl.hs:50:21: warning: [-Wdeprecations]
    In the use of ‘sendTo’ (imported from Network.Socket):
    "Use sendTo defined in "Network.Socket.ByteString""

src/System/Log/Handler/Growl.hs:109:32: warning: [-Wdeprecations]
    In the use of ‘sendTo’ (imported from Network.Socket):
    "Use sendTo defined in "Network.Socket.ByteString""

src/System/Log/Logger.hs:201:1: warning: [-Wdeprecations]
    Module ‘Control.Monad.Error’ is deprecated:
      Use Control.Monad.Except instead
Haddock coverage:
 100% (  4 /  4) in 'System.Log'
 100% (  6 /  6) in 'System.Log.Formatter'
 100% (  3 /  3) in 'System.Log.Handler'
 100% (  5 /  5) in 'System.Log.Handler.Simple'
  91% ( 10 / 11) in 'System.Log.Handler.Syslog'
  Missing documentation for:
    SyslogHandler (src/System/Log/Handler/Syslog.hs:132)
 100% (  3 /  3) in 'System.Log.Handler.Growl'
 100% ( 17 / 17) in 'System.Log.Handler.Log4jXML'
  97% ( 38 / 39) in 'System.Log.Logger'
  Missing documentation for:
    Logger (src/System/Log/Logger.hs:207)
Warning: System.Log.Handler.Growl: could not find link destinations for:
    GrowlHandler
Documentation created: dist/doc/html/hslogger/index.html,
dist/doc/html/hslogger/hslogger.txt
Creating package registration file:
/tmp/pkgConf-hslogger-1.214511630421830992300.10
Installing library in
/home/builder/hackage-server/build-cache/tmp-install/lib/x86_64-linux-ghc-8.0.1.20160701/hslogger-1.2.10-2MqNtqteqzxLp4s2hmbEFL
Registering hslogger-1.2.10...
cabal: Leaving directory '/tmp/cabal-tmp-10191/hslogger-1.2.10'
Installed hslogger-1.2.10
cabal: Entering directory '/tmp/cabal-tmp-10191/vector-0.11.0.0'
Configuring vector-0.11.0.0...
Building vector-0.11.0.0...
Preprocessing library vector-0.11.0.0...
[ 1 of 21] Compiling Data.Vector.Storable.Internal ( Data/Vector/Storable/Internal.hs, dist/build/Data/Vector/Storable/Internal.o )

Data/Vector/Storable/Internal.hs:17:1: warning: [-Wunused-imports]
    The import of ‘Foreign.ForeignPtr’ is redundant
      except perhaps to import instances from ‘Foreign.ForeignPtr’
    To import instances alone, use: import Foreign.ForeignPtr()

Data/Vector/Storable/Internal.hs:18:1: warning: [-Wunused-imports]
    The import of ‘Foreign.Ptr’ is redundant
      except perhaps to import instances from ‘Foreign.Ptr’
    To import instances alone, use: import Foreign.Ptr()
[ 2 of 21] Compiling Data.Vector.Generic.Mutable.Base ( Data/Vector/Generic/Mutable/Base.hs, dist/build/Data/Vector/Generic/Mutable/Base.o )
[ 3 of 21] Compiling Data.Vector.Generic.Base ( Data/Vector/Generic/Base.hs, dist/build/Data/Vector/Generic/Base.o )
[ 4 of 21] Compiling Data.Vector.Fusion.Util ( Data/Vector/Fusion/Util.hs, dist/build/Data/Vector/Fusion/Util.o )
[ 5 of 21] Compiling Data.Vector.Fusion.Bundle.Size ( Data/Vector/Fusion/Bundle/Size.hs, dist/build/Data/Vector/Fusion/Bundle/Size.o )
[ 6 of 21] Compiling Data.Vector.Internal.Check ( Data/Vector/Internal/Check.hs, dist/build/Data/Vector/Internal/Check.o )
[ 7 of 21] Compiling Data.Vector.Fusion.Stream.Monadic ( Data/Vector/Fusion/Stream/Monadic.hs, dist/build/Data/Vector/Fusion/Stream/Monadic.o )

Data/Vector/Fusion/Stream/Monadic.hs:431:1: warning: [-Wredundant-constraints]
    • Redundant constraints: (Monad m, Monad m')
    • In the type signature for:
           trans :: (Monad m, Monad m') =>
                    (forall z. m z -> m' z) -> Stream m a -> Stream m' a

Data/Vector/Fusion/Stream/Monadic.hs:1449:1: warning: [-Wredundant-constraints]
    • Redundant constraint: Ord a
    • In the type signature for:
           enumFromTo_double :: (Monad m, Ord a, RealFrac a) =>
                                a -> a -> Stream m a
[ 8 of 21] Compiling Data.Vector.Fusion.Bundle.Monadic ( Data/Vector/Fusion/Bundle/Monadic.hs, dist/build/Data/Vector/Fusion/Bundle/Monadic.o )

Data/Vector/Fusion/Bundle/Monadic.hs:945:1: warning: [-Wredundant-constraints]
    • Redundant constraint: Ord a
    • In the type signature for:
           enumFromTo_double :: (Monad m, Ord a, RealFrac a) =>
                                a -> a -> Bundle m v a
[ 9 of 21] Compiling Data.Vector.Fusion.Bundle ( Data/Vector/Fusion/Bundle.hs, dist/build/Data/Vector/Fusion/Bundle.o )

Data/Vector/Fusion/Bundle.hs:114:1: warning: [-Wtabs]
    Tab character found here.
    Please use spaces instead.
[10 of 21] Compiling Data.Vector.Generic.Mutable ( Data/Vector/Generic/Mutable.hs, dist/build/Data/Vector/Generic/Mutable.o )
[11 of 21] Compiling Data.Vector.Generic.New ( Data/Vector/Generic/New.hs, dist/build/Data/Vector/Generic/New.o )
[12 of 21] Compiling Data.Vector.Generic ( Data/Vector/Generic.hs, dist/build/Data/Vector/Generic.o )

Data/Vector/Generic.hs:2080:1: warning: [-Wredundant-constraints]
    • Redundant constraint: Vector v a
    • In the type signature for:
           dataCast :: (Vector v a, Data a, Typeable v, Typeable t) =>
                       (forall d. Data d => c (t d)) -> Maybe (c (v a))
[13 of 21] Compiling Data.Vector.Primitive.Mutable ( Data/Vector/Primitive/Mutable.hs, dist/build/Data/Vector/Primitive/Mutable.o )
[14 of 21] Compiling Data.Vector.Primitive ( Data/Vector/Primitive.hs, dist/build/Data/Vector/Primitive.o )
[15 of 21] Compiling Data.Vector.Storable.Mutable ( Data/Vector/Storable/Mutable.hs, dist/build/Data/Vector/Storable/Mutable.o )

Data/Vector/Storable/Mutable.hs:72:1: warning: [-Wunused-imports]
    The import of ‘Foreign.Ptr’ is redundant
      except perhaps to import instances from ‘Foreign.Ptr’
    To import instances alone, use: import Foreign.Ptr()

Data/Vector/Storable/Mutable.hs:491:1: warning: [-Wredundant-constraints]
    • Redundant constraint: Storable a
    • In the type signature for:
           unsafeFromForeignPtr0 :: Storable a =>
                                    ForeignPtr a -> Int -> MVector s a

Data/Vector/Storable/Mutable.hs:501:1: warning: [-Wredundant-constraints]
    • Redundant constraint: Storable a
    • In the type signature for:
           unsafeToForeignPtr :: Storable a =>
                                 MVector s a -> (ForeignPtr a, Int, Int)

Data/Vector/Storable/Mutable.hs:511:1: warning: [-Wredundant-constraints]
    • Redundant constraint: Storable a
    • In the type signature for:
           unsafeToForeignPtr0 :: Storable a =>
                                  MVector s a -> (ForeignPtr a, Int)

Data/Vector/Storable/Mutable.hs:518:1: warning: [-Wredundant-constraints]
    • Redundant constraint: Storable a
    • In the type signature for:
           unsafeWith :: Storable a => IOVector a -> (Ptr a -> IO b) -> IO b
[16 of 21] Compiling Data.Vector.Storable ( Data/Vector/Storable.hs, dist/build/Data/Vector/Storable.o )

Data/Vector/Storable.hs:1408:1: warning: [-Wredundant-constraints]
    • Redundant constraint: Storable a
    • In the type signature for:
           unsafeFromForeignPtr0 :: Storable a =>
                                    ForeignPtr a -> Int -> Vector a

Data/Vector/Storable.hs:1417:1: warning: [-Wredundant-constraints]
    • Redundant constraint: Storable a
    • In the type signature for:
           unsafeToForeignPtr :: Storable a =>
                                 Vector a -> (ForeignPtr a, Int, Int)

Data/Vector/Storable.hs:1426:1: warning: [-Wredundant-constraints]
    • Redundant constraint: Storable a
    • In the type signature for:
           unsafeToForeignPtr0 :: Storable a =>
                                  Vector a -> (ForeignPtr a, Int)

Data/Vector/Storable.hs:1432:1: warning: [-Wredundant-constraints]
    • Redundant constraint: Storable a
    • In the type signature for:
           unsafeWith :: Storable a => Vector a -> (Ptr a -> IO b) -> IO b
[17 of 21] Compiling Data.Vector.Unboxed.Base ( Data/Vector/Unboxed/Base.hs, dist/build/Data/Vector/Unboxed/Base.o )

Data/Vector/Unboxed/Base.hs:362:10: warning: [-Wredundant-constraints]
    • Redundant constraint: RealFloat a
    • In the instance declaration for ‘M.MVector MVector (Complex a)’
[18 of 21] Compiling Data.Vector.Unboxed ( Data/Vector/Unboxed.hs, dist/build/Data/Vector/Unboxed.o )

internal/unbox-tuple-instances:133:1: warning: [-Wredundant-constraints]
    • Redundant constraints: (Unbox a, Unbox b)
    • In the type signature for:
           unzip :: (Unbox a, Unbox b) =>
                    Vector (a, b) -> (Vector a, Vector b)

internal/unbox-tuple-instances:307:1: warning: [-Wredundant-constraints]
    • Redundant constraints: (Unbox a, Unbox b, Unbox c)
    • In the type signature for:
           unzip3 :: (Unbox a, Unbox b, Unbox c) =>
                     Vector (a, b, c) -> (Vector a, Vector b, Vector c)

internal/unbox-tuple-instances:526:1: warning: [-Wredundant-constraints]
    • Redundant constraints: (Unbox a, Unbox b, Unbox c, Unbox d)
    • In the type signature for:
           unzip4 :: (Unbox a, Unbox b, Unbox c, Unbox d) =>
                     Vector (a, b, c, d) -> (Vector a, Vector b, Vector c, Vector d)

internal/unbox-tuple-instances:803:1: warning: [-Wredundant-constraints]
    • Redundant constraints: (Unbox a,
                              Unbox b,
                              Unbox c,
                              Unbox d,
                              Unbox e)
    • In the type signature for:
           unzip5 :: (Unbox a, Unbox b, Unbox c, Unbox d, Unbox e) =>
                     Vector (a, b, c, d, e)
                     -> (Vector a, Vector b, Vector c, Vector d, Vector e)

internal/unbox-tuple-instances:1121:1: warning: [-Wredundant-constraints]
    • Redundant constraints: (Unbox a,
                              Unbox b,
                              Unbox c,
                              Unbox d,
                              Unbox e,
                              Unbox f)
    • In the type signature for:
           unzip6 :: (Unbox a, Unbox b, Unbox c, Unbox d, Unbox e, Unbox f) =>
                     Vector (a, b, c, d, e, f)
                     -> (Vector a, Vector b, Vector c, Vector d, Vector e, Vector f)
[19 of 21] Compiling Data.Vector.Unboxed.Mutable ( Data/Vector/Unboxed/Mutable.hs, dist/build/Data/Vector/Unboxed/Mutable.o )

internal/unbox-tuple-instances:117:1: warning: [-Wredundant-constraints]
    • Redundant constraints: (Unbox a, Unbox b)
    • In the type signature for:
           unzip :: (Unbox a, Unbox b) =>
                    MVector s (a, b) -> (MVector s a, MVector s b)

internal/unbox-tuple-instances:282:1: warning: [-Wredundant-constraints]
    • Redundant constraints: (Unbox a, Unbox b, Unbox c)
    • In the type signature for:
           unzip3 :: (Unbox a, Unbox b, Unbox c) =>
                     MVector s (a, b, c) -> (MVector s a, MVector s b, MVector s c)

internal/unbox-tuple-instances:493:1: warning: [-Wredundant-constraints]
    • Redundant constraints: (Unbox a, Unbox b, Unbox c, Unbox d)
    • In the type signature for:
           unzip4 :: (Unbox a, Unbox b, Unbox c, Unbox d) =>
                     MVector s (a, b, c, d)
                     -> (MVector s a, MVector s b, MVector s c, MVector s d)

internal/unbox-tuple-instances:756:1: warning: [-Wredundant-constraints]
    • Redundant constraints: (Unbox a,
                              Unbox b,
                              Unbox c,
                              Unbox d,
                              Unbox e)
    • In the type signature for:
           unzip5 :: (Unbox a, Unbox b, Unbox c, Unbox d, Unbox e) =>
                     MVector s (a, b, c, d, e)
                     -> (MVector s a, MVector s b, MVector s c, MVector s d,
                         MVector s e)

internal/unbox-tuple-instances:1066:1: warning: [-Wredundant-constraints]
    • Redundant constraints: (Unbox a,
                              Unbox b,
                              Unbox c,
                              Unbox d,
                              Unbox e,
                              Unbox f)
    • In the type signature for:
           unzip6 :: (Unbox a, Unbox b, Unbox c, Unbox d, Unbox e, Unbox f) =>
                     MVector s (a, b, c, d, e, f)
                     -> (MVector s a, MVector s b, MVector s c, MVector s d,
                         MVector s e, MVector s f)
[20 of 21] Compiling Data.Vector.Mutable ( Data/Vector/Mutable.hs, dist/build/Data/Vector/Mutable.o )
[21 of 21] Compiling Data.Vector      ( Data/Vector.hs, dist/build/Data/Vector.o )
Running Haddock for vector-0.11.0.0...
Running hscolour for vector-0.11.0.0...
Preprocessing library vector-0.11.0.0...
Preprocessing library vector-0.11.0.0...

Data/Vector/Storable/Internal.hs:17:1: warning: [-Wunused-imports]
    The import of ‘Foreign.ForeignPtr’ is redundant
      except perhaps to import instances from ‘Foreign.ForeignPtr’
    To import instances alone, use: import Foreign.ForeignPtr()

Data/Vector/Storable/Internal.hs:18:1: warning: [-Wunused-imports]
    The import of ‘Foreign.Ptr’ is redundant
      except perhaps to import instances from ‘Foreign.Ptr’
    To import instances alone, use: import Foreign.Ptr()

Data/Vector/Fusion/Stream/Monadic.hs:431:1: warning: [-Wredundant-constraints]
    • Redundant constraints: (Monad m, Monad m')
    • In the type signature for:
           trans :: (Monad m, Monad m') =>
                    (forall z. m z -> m' z) -> Stream m a -> Stream m' a

Data/Vector/Fusion/Stream/Monadic.hs:1449:1: warning: [-Wredundant-constraints]
    • Redundant constraint: Ord a
    • In the type signature for:
           enumFromTo_double :: (Monad m, Ord a, RealFrac a) =>
                                a -> a -> Stream m a

Data/Vector/Fusion/Bundle/Monadic.hs:945:1: warning: [-Wredundant-constraints]
    • Redundant constraint: Ord a
    • In the type signature for:
           enumFromTo_double :: (Monad m, Ord a, RealFrac a) =>
                                a -> a -> Bundle m v a

Data/Vector/Fusion/Bundle.hs:114:1: warning: [-Wtabs]
    Tab character found here.
    Please use spaces instead.

Data/Vector/Generic.hs:2080:1: warning: [-Wredundant-constraints]
    • Redundant constraint: Vector v a
    • In the type signature for:
           dataCast :: (Vector v a, Data a, Typeable v, Typeable t) =>
                       (forall d. Data d => c (t d)) -> Maybe (c (v a))
Haddock coverage:
  25% (  1 /  4) in 'Data.Vector.Storable.Internal'
  Missing documentation for:
    getPtr (Data/Vector/Storable/Internal.hs:22)
    setPtr (Data/Vector/Storable/Internal.hs:26)
    updPtr (Data/Vector/Storable/Internal.hs:30)
 100% (  2 /  2) in 'Data.Vector.Generic.Mutable.Base'
 100% (  3 /  3) in 'Data.Vector.Generic.Base'
 100% (  5 /  5) in 'Data.Vector.Fusion.Util'
 100% (  8 /  8) in 'Data.Vector.Fusion.Bundle.Size'
  11% (  1 /  9) in 'Data.Vector.Internal.Check'
  Missing documentation for:
    Checks (Data/Vector/Internal/Check.hs:51)
    doChecks (Data/Vector/Internal/Check.hs:75)
    error (Data/Vector/Internal/Check.hs:84)
    internalError (Data/Vector/Internal/Check.hs:89)
    check (Data/Vector/Internal/Check.hs:105)
    checkIndex (Data/Vector/Internal/Check.hs:119)
    checkLength (Data/Vector/Internal/Check.hs:133)
    checkSlice (Data/Vector/Internal/Check.hs:147)
  82% (103 /125) in 'Data.Vector.Fusion.Stream.Monadic'
  Missing documentation for:
    generate (Data/Vector/Fusion/Stream/Monadic.hs:184)
    unbox (Data/Vector/Fusion/Stream/Monadic.hs:436)
    concatMap (Data/Vector/Fusion/Stream/Monadic.hs:996)
    zipWithM_ (Data/Vector/Fusion/Stream/Monadic.hs:512)
    zipWith3M (Data/Vector/Fusion/Stream/Monadic.hs:516)
    zipWith4M (Data/Vector/Fusion/Stream/Monadic.hs:544)
    zipWith5M (Data/Vector/Fusion/Stream/Monadic.hs:551)
    zipWith6M (Data/Vector/Fusion/Stream/Monadic.hs:558)
    zipWith (Data/Vector/Fusion/Stream/Monadic.hs:566)
    zipWith3 (Data/Vector/Fusion/Stream/Monadic.hs:570)
    zipWith4 (Data/Vector/Fusion/Stream/Monadic.hs:575)
    zipWith5 (Data/Vector/Fusion/Stream/Monadic.hs:581)
    zipWith6 (Data/Vector/Fusion/Stream/Monadic.hs:587)
    zip (Data/Vector/Fusion/Stream/Monadic.hs:593)
    zip3 (Data/Vector/Fusion/Stream/Monadic.hs:597)
    zip4 (Data/Vector/Fusion/Stream/Monadic.hs:601)
    zip5 (Data/Vector/Fusion/Stream/Monadic.hs:606)
    zip6 (Data/Vector/Fusion/Stream/Monadic.hs:611)
    and (Data/Vector/Fusion/Stream/Monadic.hs:970)
    or (Data/Vector/Fusion/Stream/Monadic.hs:983)
    concatMapM (Data/Vector/Fusion/Stream/Monadic.hs:1000)
    unfoldrN (Data/Vector/Fusion/Stream/Monadic.hs:1062)
  79% (106 /135) in 'Data.Vector.Fusion.Bundle.Monadic'
  Missing documentation for:
    Chunk (Data/Vector/Fusion/Bundle/Monadic.hs:110)
    generate (Data/Vector/Fusion/Bundle/Monadic.hs:190)
    unbox (Data/Vector/Fusion/Bundle/Monadic.hs:301)
    concatMap (Data/Vector/Fusion/Bundle/Monadic.hs:595)
    zipWithM_ (Data/Vector/Fusion/Bundle/Monadic.hs:332)
    zipWith3M (Data/Vector/Fusion/Bundle/Monadic.hs:336)
    zipWith4M (Data/Vector/Fusion/Bundle/Monadic.hs:343)
    zipWith5M (Data/Vector/Fusion/Bundle/Monadic.hs:350)
    zipWith6M (Data/Vector/Fusion/Bundle/Monadic.hs:357)
    zipWith (Data/Vector/Fusion/Bundle/Monadic.hs:365)
    zipWith3 (Data/Vector/Fusion/Bundle/Monadic.hs:369)
    zipWith4 (Data/Vector/Fusion/Bundle/Monadic.hs:374)
    zipWith5 (Data/Vector/Fusion/Bundle/Monadic.hs:380)
    zipWith6 (Data/Vector/Fusion/Bundle/Monadic.hs:386)
    zip (Data/Vector/Fusion/Bundle/Monadic.hs:392)
    zip3 (Data/Vector/Fusion/Bundle/Monadic.hs:396)
    zip4 (Data/Vector/Fusion/Bundle/Monadic.hs:400)
    zip5 (Data/Vector/Fusion/Bundle/Monadic.hs:405)
    zip6 (Data/Vector/Fusion/Bundle/Monadic.hs:410)
    and (Data/Vector/Fusion/Bundle/Monadic.hs:587)
    or (Data/Vector/Fusion/Bundle/Monadic.hs:591)
    concatMapM (Data/Vector/Fusion/Bundle/Monadic.hs:599)
    fromVector (Data/Vector/Fusion/Bundle/Monadic.hs:1009)
    reVector (Data/Vector/Fusion/Bundle/Monadic.hs:1085)
    fromVectors (Data/Vector/Fusion/Bundle/Monadic.hs:1028)
    concatVectors (Data/Vector/Fusion/Bundle/Monadic.hs:1054)
    fromStream (Data/Vector/Fusion/Bundle/Monadic.hs:119)
    chunks (Data/Vector/Fusion/Bundle/Monadic.hs:126)
    elements (Data/Vector/Fusion/Bundle/Monadic.hs:130)
  81% ( 88 /109) in 'Data.Vector.Fusion.Bundle'
  Missing documentation for:
    Chunk (Data/Vector/Fusion/Bundle/Monadic.hs:110)
    inplace (Data/Vector/Fusion/Bundle.hs:113)
    concatMap (Data/Vector/Fusion/Bundle.hs:265)
    unbox (Data/Vector/Fusion/Bundle.hs:261)
    zipWith4 (Data/Vector/Fusion/Bundle.hs:293)
    zipWith5 (Data/Vector/Fusion/Bundle.hs:299)
    zipWith6 (Data/Vector/Fusion/Bundle.hs:305)
    zip (Data/Vector/Fusion/Bundle.hs:311)
    zip3 (Data/Vector/Fusion/Bundle.hs:315)
    zip4 (Data/Vector/Fusion/Bundle.hs:319)
    zip5 (Data/Vector/Fusion/Bundle.hs:324)
    zip6 (Data/Vector/Fusion/Bundle.hs:329)
    and (Data/Vector/Fusion/Bundle.hs:415)
    or (Data/Vector/Fusion/Bundle.hs:419)
    unsafeFromList (Data/Vector/Fusion/Bundle.hs:609)
    fromVector (Data/Vector/Fusion/Bundle.hs:613)
    reVector (Data/Vector/Fusion/Bundle.hs:617)
    fromVectors (Data/Vector/Fusion/Bundle.hs:621)
    concatVectors (Data/Vector/Fusion/Bundle.hs:625)
    zipWithM (Data/Vector/Fusion/Bundle.hs:520)
    zipWithM_ (Data/Vector/Fusion/Bundle.hs:524)
  66% ( 48 / 73) in 'Data.Vector.Generic.Mutable'
  Missing documentation for:
    init (Data/Vector/Generic/Mutable.hs:536)
    tail (Data/Vector/Generic/Mutable.hs:540)
    take (Data/Vector/Generic/Mutable.hs:515)
    drop (Data/Vector/Generic/Mutable.hs:519)
    splitAt (Data/Vector/Generic/Mutable.hs:527)
    unsafeInit (Data/Vector/Generic/Mutable.hs:554)
    unsafeTail (Data/Vector/Generic/Mutable.hs:558)
    unsafeTake (Data/Vector/Generic/Mutable.hs:562)
    unsafeDrop (Data/Vector/Generic/Mutable.hs:566)
    growFront (Data/Vector/Generic/Mutable.hs:626)
    unsafeGrowFront (Data/Vector/Generic/Mutable.hs:665)
    mstream (Data/Vector/Generic/Mutable.hs:244)
    mstreamR (Data/Vector/Generic/Mutable.hs:274)
    transform (Data/Vector/Generic/Mutable.hs:268)
    transformR (Data/Vector/Generic/Mutable.hs:303)
    fill (Data/Vector/Generic/Mutable.hs:255)
    fillR (Data/Vector/Generic/Mutable.hs:287)
    unsafeAccum (Data/Vector/Generic/Mutable.hs:848)
    accum (Data/Vector/Generic/Mutable.hs:824)
    unsafeUpdate (Data/Vector/Generic/Mutable.hs:861)
    update (Data/Vector/Generic/Mutable.hs:837)
    reverse (Data/Vector/Generic/Mutable.hs:872)
    unstablePartition (Data/Vector/Generic/Mutable.hs:881)
    unstablePartitionBundle (Data/Vector/Generic/Mutable.hs:910)
    partitionBundle (Data/Vector/Generic/Mutable.hs:938)
   5% (  1 / 20) in 'Data.Vector.Generic.New'
  Missing documentation for:
    New (Data/Vector/Generic/New.hs:40)
    create (Data/Vector/Generic/New.hs:42)
    run (Data/Vector/Generic/New.hs:46)
    runPrim (Data/Vector/Generic/New.hs:50)
    apply (Data/Vector/Generic/New.hs:54)
    modify (Data/Vector/Generic/New.hs:58)
    modifyWithBundle (Data/Vector/Generic/New.hs:62)
    unstream (Data/Vector/Generic/New.hs:67)
    transform (Data/Vector/Generic/New.hs:71)
    unstreamR (Data/Vector/Generic/New.hs:93)
    transformR (Data/Vector/Generic/New.hs:97)
    slice (Data/Vector/Generic/New.hs:119)
    init (Data/Vector/Generic/New.hs:123)
    tail (Data/Vector/Generic/New.hs:127)
    take (Data/Vector/Generic/New.hs:131)
    drop (Data/Vector/Generic/New.hs:135)
    unsafeSlice (Data/Vector/Generic/New.hs:139)
    unsafeInit (Data/Vector/Generic/New.hs:143)
    unsafeTail (Data/Vector/Generic/New.hs:147)
  93% (223 /240) in 'Data.Vector.Generic'
  Missing documentation for:
    zipWith4 (Data/Vector/Generic.hs:1069)
    zipWith5 (Data/Vector/Generic.hs:1078)
    zipWith6 (Data/Vector/Generic.hs:1090)
    izipWith3 (Data/Vector/Generic.hs:1112)
    izipWith4 (Data/Vector/Generic.hs:1120)
    izipWith5 (Data/Vector/Generic.hs:1129)
    izipWith6 (Data/Vector/Generic.hs:1141)
    zip3 (Data/Vector/Generic.hs:1159)
    zip4 (Data/Vector/Generic.hs:1164)
    zip5 (Data/Vector/Generic.hs:1169)
    zip6 (Data/Vector/Generic.hs:1175)
    unzip3 (Data/Vector/Generic.hs:1225)
    unzip4 (Data/Vector/Generic.hs:1232)
    unzip5 (Data/Vector/Generic.hs:1241)
    unzip6 (Data/Vector/Generic.hs:1251)
    dataCast (Data/Vector/Generic.hs:2080)
    mkType (Data/Vector/Generic.hs:2075)
  79% ( 41 / 52) in 'Data.Vector.Primitive.Mutable'
  Missing documen
Data/Vector/Storable/Mutable.hs:72:1: warning: [-Wunused-imports]
    The import of ‘Foreign.Ptr’ is redundant
      except perhaps to import instances from ‘Foreign.Ptr’
    To import instances alone, use: import Foreign.Ptr()

Data/Vector/Storable/Mutable.hs:491:1: warning: [-Wredundant-constraints]
    • Redundant constraint: Storable a
    • In the type signature for:
           unsafeFromForeignPtr0 :: Storable a =>
                                    ForeignPtr a -> Int -> MVector s a

Data/Vector/Storable/Mutable.hs:501:1: warning: [-Wredundant-constraints]
    • Redundant constraint: Storable a
    • In the type signature for:
           unsafeToForeignPtr :: Storable a =>
                                 MVector s a -> (ForeignPtr a, Int, Int)

Data/Vector/Storable/Mutable.hs:511:1: warning: [-Wredundant-constraints]
    • Redundant constraint: Storable a
    • In the type signature for:
           unsafeToForeignPtr0 :: Storable a =>
                                  MVector s a -> (ForeignPtr a, Int)

Data/Vector/Storable/Mutable.hs:518:1: warning: [-Wredundant-constraints]
    • Redundant constraint: Storable a
    • In the type signature for:
           unsafeWith :: Storable a => IOVector a -> (Ptr a -> IO b) -> IO b

Data/Vector/Storable.hs:1408:1: warning: [-Wredundant-constraints]
    • Redundant constraint: Storable a
    • In the type signature for:
           unsafeFromForeignPtr0 :: Storable a =>
                                    ForeignPtr a -> Int -> Vector a

Data/Vector/Storable.hs:1417:1: warning: [-Wredundant-constraints]
    • Redundant constraint: Storable a
    • In the type signature for:
           unsafeToForeignPtr :: Storable a =>
                                 Vector a -> (ForeignPtr a, Int, Int)

Data/Vector/Storable.hs:1426:1: warning: [-Wredundant-constraints]
    • Redundant constraint: Storable a
    • In the type signature for:
           unsafeToForeignPtr0 :: Storable a =>
                                  Vector a -> (ForeignPtr a, Int)

Data/Vector/Storable.hs:1432:1: warning: [-Wredundant-constraints]
    • Redundant constraint: Storable a
    • In the type signature for:
           unsafeWith :: Storable a => Vector a -> (Ptr a -> IO b) -> IO b

Data/Vector/Unboxed/Base.hs:362:10: warning: [-Wredundant-constraints]
    • Redundant constraint: RealFloat a
    • In the instance declaration for ‘M.MVector MVector (Complex a)’

internal/unbox-tuple-instances:133:1: warning: [-Wredundant-constraints]
    • Redundant constraints: (Unbox a, Unbox b)
    • In the type signature for:
           unzip :: (Unbox a, Unbox b) =>
                    Vector (a, b) -> (Vector a, Vector b)

internal/unbox-tuple-instances:307:1: warning: [-Wredundant-constraints]
    • Redundant constraints: (Unbox a, Unbox b, Unbox c)
    • In the type signature for:
           unzip3 :: (Unbox a, Unbox b, Unbox c) =>
                     Vector (a, b, c) -> (Vector a, Vector b, Vector c)

internal/unbox-tuple-instances:526:1: warning: [-Wredundant-constraints]
    • Redundant constraints: (Unbox a, Unbox b, Unbox c, Unbox d)
    • In the type signature for:
           unzip4 :: (Unbox a, Unbox b, Unbox c, Unbox d) =>
                     Vector (a, b, c, d) -> (Vector a, Vector b, Vector c, Vector d)

internal/unbox-tuple-instances:803:1: warning: [-Wredundant-constraints]
    • Redundant constraints: (Unbox a,
                              Unbox b,
                              Unbox c,
                              Unbox d,
                              Unbox e)
    • In the type signature for:
           unzip5 :: (Unbox a, Unbox b, Unbox c, Unbox d, Unbox e) =>
                     Vector (a, b, c, d, e)
                     -> (Vector a, Vector b, Vector c, Vector d, Vector e)

internal/unbox-tuple-instances:1121:1: warning: [-Wredundant-constraints]
    • Redundant constraints: (Unbox a,
                              Unbox b,
                              Unbox c,
                              Unbox d,
                              Unbox e,
                              Unbox f)
    • In the type signature for:
           unzip6 :: (Unbox a, Unbox b, Unbox c, Unbox d, Unbox e, Unbox f) =>
                     Vector (a, b, c, d, e, f)
                     -> (Vector a, Vector b, Vector c, Vector d, Vector e, Vector f)

internal/unbox-tuple-instances:117:1: warning: [-Wredundant-constraints]
    • Redundant constraints: (Unbox a, Unbox b)
    • In the type signature for:
           unzip :: (Unbox a, Unbox b) =>
                    MVector s (a, b) -> (MVector s a, MVector s b)

internal/unbox-tuple-instances:282:1: warning: [-Wredundant-constraints]
    • Redundant constraints: (Unbox a, Unbox b, Unbox c)
    • In the type signature for:
           unzip3 :: (Unbox a, Unbox b, Unbox c) =>
                     MVector s (a, b, c) -> (MVector s a, MVector s b, MVector s c)

internal/unbox-tuple-instances:493:1: warning: [-Wredundant-constraints]
    • Redundant constraints: (Unbox a, Unbox b, Unbox c, Unbox d)
    • In the type signature for:
           unzip4 :: (Unbox a, Unbox b, Unbox c, Unbox d) =>
                     MVector s (a, b, c, d)
                     -> (MVector s a, MVector s b, MVector s c, MVector s d)

internal/unbox-tuple-instances:756:1: warning: [-Wredundant-constraints]
    • Redundant constraints: (Unbox a,
                              Unbox b,
                              Unbox c,
                              Unbox d,
                              Unbox e)
    • In the type signature for:
           unzip5 :: (Unbox a, Unbox b, Unbox c, Unbox d, Unbox e) =>
                     MVector s (a, b, c, d, e)
                     -> (MVector s a, MVector s b, MVector s c, MVector s d,
                         MVector s e)

internal/unbox-tuple-instances:1066:1: warning: [-Wredundant-constraints]
    • Redundant constraints: (Unbox a,
                              Unbox b,
                              Unbox c,
                              Unbox d,
                              Unbox e,
                              Unbox f)
    • In the type signature for:
           unzip6 :: (Unbox a, Unbox b, Unbox c, Unbox d, Unbox e, Unbox f) =>
                     MVector s (a, b, c, d, e, f)
                     -> (MVector s a, MVector s b, MVector s c, MVector s d,
                         MVector s e, MVector s f)
tation for:
    IOVector (Data/Vector/Primitive/Mutable.hs:76)
    STVector (Data/Vector/Primitive/Mutable.hs:77)
    init (Data/Vector/Primitive/Mutable.hs:164)
    tail (Data/Vector/Primitive/Mutable.hs:168)
    take (Data/Vector/Primitive/Mutable.hs:152)
    drop (Data/Vector/Primitive/Mutable.hs:156)
    splitAt (Data/Vector/Primitive/Mutable.hs:160)
    unsafeInit (Data/Vector/Primitive/Mutable.hs:190)
    unsafeTail (Data/Vector/Primitive/Mutable.hs:194)
    unsafeTake (Data/Vector/Primitive/Mutable.hs:182)
    unsafeDrop (Data/Vector/Primitive/Mutable.hs:186)
  97% (185 /191) in 'Data.Vector.Primitive'
  Missing documentation for:
    zipWith4 (Data/Vector/Primitive.hs:802)
    zipWith5 (Data/Vector/Primitive.hs:808)
    zipWith6 (Data/Vector/Primitive.hs:816)
    izipWith4 (Data/Vector/Primitive.hs:838)
    izipWith5 (Data/Vector/Primitive.hs:844)
    izipWith6 (Data/Vector/Primitive.hs:852)
  82% ( 49 / 60) in 'Data.Vector.Storable.Mutable'
  Missing documentation for:
    IOVector (Data/Vector/Storable/Mutable.hs:96)
    STVector (Data/Vector/Storable/Mutable.hs:97)
    init (Data/Vector/Storable/Mutable.hs:246)
    tail (Data/Vector/Storable/Mutable.hs:250)
    take (Data/Vector/Storable/Mutable.hs:234)
    drop (Data/Vector/Storable/Mutable.hs:238)
    splitAt (Data/Vector/Storable/Mutable.hs:242)
    unsafeInit (Data/Vector/Storable/Mutable.hs:272)
    unsafeTail (Data/Vector/Storable/Mutable.hs:276)
    unsafeTake (Data/Vector/Storable/Mutable.hs:264)
    unsafeDrop (Data/Vector/Storable/Mutable.hs:268)
  97% (194 /200) in 'Data.Vector.Storable'
  Missing documentation for:
    zipWith4 (Data/Vector/Storable.hs:812)
    zipWith5 (Data/Vector/Storable.hs:818)
    zipWith6 (Data/Vector/Storable.hs:826)
    izipWith4 (Data/Vector/Storable.hs:848)
    izipWith5 (Data/Vector/Storable.hs:854)
    izipWith6 (Data/Vector/Storable.hs:862)
  17% (  1 /  6) in 'Data.Vector.Unboxed.Base'
  Missing documentation for:
    MVector (Data/Vector/Unboxed/Base.hs:55)
    IOVector (Data/Vector/Unboxed/Base.hs:58)
    STVector (Data/Vector/Unboxed/Base.hs:59)
    Vector (Data/Vector/Unboxed/Base.hs:56)
    Unbox (Data/Vector/Unboxed/Base.hs:63)
  96% (209 /218) in 'Data.Vector.Unboxed'
  Missing documentation for:
    Vector (Data/Vector/Unboxed/Base.hs:56)
    MVector (Data/Vector/Unboxed/Base.hs:55)
    Unbox (Data/Vector/Unboxed/Base.hs:63)
    zipWith4 (Data/Vector/Unboxed.hs:849)
    zipWith5 (Data/Vector/Unboxed.hs:855)
    zipWith6 (Data/Vector/Unboxed.hs:862)
    izipWith4 (Data/Vector/Unboxed.hs:883)
    izipWith5 (Data/Vector/Unboxed.hs:889)
    izipWith6 (Data/Vector/Unboxed.hs:896)
  79% ( 50 / 63) in 'Data.Vector.Unboxed.Mutable'
  Missing documentation for:
    MVector (Data/Vector/Unboxed/Base.hs:55)
    IOVector (Data/Vector/Unboxed/Base.hs:58)
    STVector (Data/Vector/Unboxed/Base.hs:59)
    Unbox (Data/Vector/Unboxed/Base.hs:63)
    init (Data/Vector/Unboxed/Mutable.hs:102)
    tail (Data/Vector/Unboxed/Mutable.hs:106)
    take (Data/Vector/Unboxed/Mutable.hs:90)
    drop (Data/Vector/Unboxed/Mutable.hs:94)
    splitAt (Data/Vector/Unboxed/Mutable.hs:98)
    unsafeInit (Data/Vector/Unboxed/Mutable.hs:128)
    unsafeTail (Data/Vector/Unboxed/Mutable.hs:132)
    unsafeTake (Data/Vector/Unboxed/Mutable.hs:120)
    unsafeDrop (Data/Vector/Unboxed/Mutable.hs:124)
  78% ( 40 / 51) in 'Data.Vector.Mutable'
  Missing documentation for:
    IOVector (Data/Vector/Mutable.hs:70)
    STVector (Data/Vector/Mutable.hs:71)
    init (Data/Vector/Mutable.hs:222)
    tail (Data/Vector/Mutable.hs:226)
    take (Data/Vector/Mutable.hs:210)
    drop (Data/Vector/Mutable.hs:214)
    splitAt (Data/Vector/Mutable.hs:219)
    unsafeInit (Data/Vector/Mutable.hs:247)
    unsafeTail (Data/Vector/Mutable.hs:251)
    unsafeTake (Data/Vector/Mutable.hs:239)
    unsafeDrop (Data/Vector/Mutable.hs:243)
  94% (207 /220) in 'Data.Vector'
  Missing documentation for:
    zipWith4 (Data/Vector.hs:944)
    zipWith5 (Data/Vector.hs:949)
    zipWith6 (Data/Vector.hs:955)
    izipWith4 (Data/Vector.hs:973)
    izipWith5 (Data/Vector.hs:978)
    izipWith6 (Data/Vector.hs:984)
    zip4 (Data/Vector.hs:1000)
    zip5 (Data/Vector.hs:1005)
    zip6 (Data/Vector.hs:1010)
    unzip3 (Data/Vector.hs:1023)
    unzip4 (Data/Vector.hs:1027)
    unzip5 (Data/Vector.hs:1031)
    unzip6 (Data/Vector.hs:1036)
Warning: Data.Vector.Unboxed: could not find link destinations for:
    D:R:VectorBool0 V_Bool D:R:VectorChar0 V_Char D:R:VectorDouble0 V_Double D:R:VectorFloat0 V_Float D:R:VectorInt0 V_Int D:R:VectorInt80 V_Int8 D:R:VectorInt160 V_Int16 D:R:VectorInt320 V_Int32 D:R:VectorInt640 V_Int64 D:R:VectorWord0 V_Word D:R:VectorWord80 V_Word8 D:R:VectorWord160 V_Word16 D:R:VectorWord320 V_Word32 D:R:VectorWord640 V_Word64 D:R:Vector()0 V_Unit D:R:VectorComplex0 V_Complex D:R:Vector(,)0 V_2 D:R:Vector(,,)0 V_3 D:R:Vector(,,,)0 V_4 D:R:Vector(,,,,)0 V_5 D:R:Vector(,,,,,)0 V_6 D:R:MVectorsBool0 MV_Bool D:R:MVectorsChar0 MV_Char D:R:MVectorsDouble0 MV_Double D:R:MVectorsFloat0 MV_Float D:R:MVectorsWord640 MV_Word64 D:R:MVectorsWord320 MV_Word32 D:R:MVectorsWord160 MV_Word16 D:R:MVectorsWord80 MV_Word8 D:R:MVectorsWord0 MV_Word D:R:MVectorsInt640 MV_Int64 D:R:MVectorsInt320 MV_Int32 D:R:MVectorsInt160 MV_Int16 D:R:MVectorsInt80 MV_Int8 D:R:MVectorsInt0 MV_Int D:R:MVectors()0 MV_Unit D:R:MVectorsComplex0 MV_Complex D:R:MVectors(,)0 MV_2 D:R:MVectors(,,)0 MV_3 D:R:MVectors(,,,)0 MV_4 D:R:MVectors(,,,,)0 MV_5 D:R:MVectors(,,,,,)0 MV_6
Warning: Data.Vector.Unboxed.Mutable: could not find link destinations for:
    D:R:MVectorsBool0 MV_Bool D:R:MVectorsChar0 MV_Char D:R:MVectorsDouble0 MV_Double D:R:MVectorsFloat0 MV_Float D:R:MVectorsWord640 MV_Word64 D:R:MVectorsWord320 MV_Word32 D:R:MVectorsWord160 MV_Word16 D:R:MVectorsWord80 MV_Word8 D:R:MVectorsWord0 MV_Word D:R:MVectorsInt640 MV_Int64 D:R:MVectorsInt320 MV_Int32 D:R:MVectorsInt160 MV_Int16 D:R:MVectorsInt80 MV_Int8 D:R:MVectorsInt0 MV_Int D:R:MVectors()0 MV_Unit D:R:MVectorsComplex0 MV_Complex D:R:MVectors(,)0 MV_2 D:R:MVectors(,,)0 MV_3 D:R:MVectors(,,,)0 MV_4 D:R:MVectors(,,,,)0 MV_5 D:R:MVectors(,,,,,)0 MV_6
Documentation created: dist/doc/html/vector/index.html,
dist/doc/html/vector/vector.txt
Creating package registration file:
/tmp/pkgConf-vector-0.11.08310835981142699356.0
Installing library in
/home/builder/hackage-server/build-cache/tmp-install/lib/x86_64-linux-ghc-8.0.1.20160701/vector-0.11.0.0-6uB77qGCxR6GPLxI2sqsX3
Registering vector-0.11.0.0...
cabal: Leaving directory '/tmp/cabal-tmp-10191/vector-0.11.0.0'
Installed vector-0.11.0.0
cabal: Entering directory '/tmp/cabal-tmp-10191/tf-random-0.5'
Configuring tf-random-0.5...
Building tf-random-0.5...
Preprocessing library tf-random-0.5...
[1 of 4] Compiling System.Random.TF.Gen ( src/System/Random/TF/Gen.hs, dist/build/System/Random/TF/Gen.o )
[2 of 4] Compiling System.Random.TF.Init ( src/System/Random/TF/Init.hs, dist/build/System/Random/TF/Init.o )

src/System/Random/TF/Init.hs:94:5: warning: [-Wdeprecations]
    In the use of ‘bitSize’ (imported from Data.Bits):
    Deprecated: "Use 'bitSizeMaybe' or 'finiteBitSize' instead"
[3 of 4] Compiling System.Random.TF.Instances ( src/System/Random/TF/Instances.hs, dist/build/System/Random/TF/Instances.o )
[4 of 4] Compiling System.Random.TF ( src/System/Random/TF.hs, dist/build/System/Random/TF.o )
Running Haddock for tf-random-0.5...
Running hscolour for tf-random-0.5...
Preprocessing library tf-random-0.5...
Preprocessing library tf-random-0.5...

src/System/Random/TF/Init.hs:94:5: warning: [-Wdeprecations]
    In the use of ‘bitSize’ (imported from Data.Bits):
    Deprecated: "Use 'bitSizeMaybe' or 'finiteBitSize' instead"
Haddock coverage:
 100% (  4 /  4) in 'System.Random.TF.Gen'
  83% (  5 /  6) in 'System.Random.TF.Init'
  Missing documentation for:
    Module header
  33% (  1 /  3) in 'System.Random.TF.Instances'
  Missing documentation for:
    Random (src/System/Random/TF/Instances.hs:37)
    randomEnum (src/System/Random/TF/Instances.hs:205)
 100% (  3 /  3) in 'System.Random.TF'
Documentation created: dist/doc/html/tf-random/index.html,
dist/doc/html/tf-random/tf-random.txt
Creating package registration file:
/tmp/pkgConf-tf-random-07549632902066120160.5
Installing library in
/home/builder/hackage-server/build-cache/tmp-install/lib/x86_64-linux-ghc-8.0.1.20160701/tf-random-0.5-4z8OJUaXC1FRNfrLPFWAD
Registering tf-random-0.5...
cabal: Leaving directory '/tmp/cabal-tmp-10191/tf-random-0.5'
Installed tf-random-0.5
cabal: Entering directory '/tmp/cabal-tmp-10191/hashable-1.2.4.0'
Configuring hashable-1.2.4.0...
Building hashable-1.2.4.0...
Preprocessing library hashable-1.2.4.0...
[1 of 3] Compiling Data.Hashable.Class ( Data/Hashable/Class.hs, dist/build/Data/Hashable/Class.o )

Data/Hashable/Class.hs:460:28: warning: [-Wdeprecations]
    In the use of ‘inlinePerformIO’
    (imported from Data.ByteString.Internal):
    Deprecated: "If you think you know what you are doing, use 'unsafePerformIO'. If you are sure you know what you are doing, use 'unsafeDupablePerformIO'. If you enjoy sharing an address space with a malevolent agent of chaos, try 'accursedUnutterablePerformIO'."
[2 of 3] Compiling Data.Hashable.Generic ( Data/Hashable/Generic.hs, dist/build/Data/Hashable/Generic.o )
[3 of 3] Compiling Data.Hashable    ( Data/Hashable.hs, dist/build/Data/Hashable.o )
Running Haddock for hashable-1.2.4.0...
Running hscolour for hashable-1.2.4.0...
Preprocessing library hashable-1.2.4.0...
Preprocessing library hashable-1.2.4.0...

Data/Hashable/Class.hs:460:28: warning: [-Wdeprecations]
    In the use of ‘inlinePerformIO’
    (imported from Data.ByteString.Internal):
    Deprecated: "If you think you know what you are doing, use 'unsafePerformIO'. If you are sure you know what you are doing, use 'unsafeDupablePerformIO'. If you enjoy sharing an address space with a malevolent agent of chaos, try 'accursedUnutterablePerformIO'."
Haddock coverage:
 100% ( 11 / 11) in 'Data.Hashable.Class'
 100% (  1 /  1) in 'Data.Hashable.Generic'
 100% ( 22 / 22) in 'Data.Hashable'
Warning: Data.Hashable: could not find link destinations for:
    GHashable
Documentation created: dist/doc/html/hashable/index.html,
dist/doc/html/hashable/hashable.txt
Creating package registration file:
/tmp/pkgConf-hashable-1.2.4186391879991742780.0
Installing library in
/home/builder/hackage-server/build-cache/tmp-install/lib/x86_64-linux-ghc-8.0.1.20160701/hashable-1.2.4.0-Ctl752zbguF6QanxurLOm2
Registering hashable-1.2.4.0...
cabal: Leaving directory '/tmp/cabal-tmp-10191/hashable-1.2.4.0'
Installed hashable-1.2.4.0
cabal: Entering directory '/tmp/cabal-tmp-10191/parsec-3.1.11'
Configuring parsec-3.1.11...
Building parsec-3.1.11...
Preprocessing library parsec-3.1.11...
[ 1 of 25] Compiling Text.Parsec.Pos  ( Text/Parsec/Pos.hs, dist/build/Text/Parsec/Pos.o )
[ 2 of 25] Compiling Text.Parsec.Error ( Text/Parsec/Error.hs, dist/build/Text/Parsec/Error.o )
[ 3 of 25] Compiling Text.ParserCombinators.Parsec.Error ( Text/ParserCombinators/Parsec/Error.hs, dist/build/Text/ParserCombinators/Parsec/Error.o )
[ 4 of 25] Compiling Text.Parsec.Prim ( Text/Parsec/Prim.hs, dist/build/Text/Parsec/Prim.o )
[ 5 of 25] Compiling Text.Parsec.Combinator ( Text/Parsec/Combinator.hs, dist/build/Text/Parsec/Combinator.o )
[ 6 of 25] Compiling Text.ParserCombinators.Parsec.Combinator ( Text/ParserCombinators/Parsec/Combinator.hs, dist/build/Text/ParserCombinators/Parsec/Combinator.o )
[ 7 of 25] Compiling Text.Parsec.String ( Text/Parsec/String.hs, dist/build/Text/Parsec/String.o )
[ 8 of 25] Compiling Text.Parsec.ByteString ( Text/Parsec/ByteString.hs, dist/build/Text/Parsec/ByteString.o )
[ 9 of 25] Compiling Text.Parsec.ByteString.Lazy ( Text/Parsec/ByteString/Lazy.hs, dist/build/Text/Parsec/ByteString/Lazy.o )
[10 of 25] Compiling Text.Parsec.Text ( Text/Parsec/Text.hs, dist/build/Text/Parsec/Text.o )
[11 of 25] Compiling Text.Parsec.Text.Lazy ( Text/Parsec/Text/Lazy.hs, dist/build/Text/Parsec/Text/Lazy.o )
[12 of 25] Compiling Text.Parsec.Expr ( Text/Parsec/Expr.hs, dist/build/Text/Parsec/Expr.o )
[13 of 25] Compiling Text.ParserCombinators.Parsec.Prim ( Text/ParserCombinators/Parsec/Prim.hs, dist/build/Text/ParserCombinators/Parsec/Prim.o )
[14 of 25] Compiling Text.ParserCombinators.Parsec.Pos ( Text/ParserCombinators/Parsec/Pos.hs, dist/build/Text/ParserCombinators/Parsec/Pos.o )
[15 of 25] Compiling Text.Parsec.Char ( Text/Parsec/Char.hs, dist/build/Text/Parsec/Char.o )
[16 of 25] Compiling Text.Parsec.Token ( Text/Parsec/Token.hs, dist/build/Text/Parsec/Token.o )
[17 of 25] Compiling Text.ParserCombinators.Parsec.Token ( Text/ParserCombinators/Parsec/Token.hs, dist/build/Text/ParserCombinators/Parsec/Token.o )
[18 of 25] Compiling Text.ParserCombinators.Parsec.Char ( Text/ParserCombinators/Parsec/Char.hs, dist/build/Text/ParserCombinators/Parsec/Char.o )
[19 of 25] Compiling Text.ParserCombinators.Parsec ( Text/ParserCombinators/Parsec.hs, dist/build/Text/ParserCombinators/Parsec.o )
[20 of 25] Compiling Text.ParserCombinators.Parsec.Expr ( Text/ParserCombinators/Parsec/Expr.hs, dist/build/Text/ParserCombinators/Parsec/Expr.o )
[21 of 25] Compiling Text.Parsec      ( Text/Parsec.hs, dist/build/Text/Parsec.o )
[22 of 25] Compiling Text.Parsec.Language ( Text/Parsec/Language.hs, dist/build/Text/Parsec/Language.o )
[23 of 25] Compiling Text.ParserCombinators.Parsec.Language ( Text/ParserCombinators/Parsec/Language.hs, dist/build/Text/ParserCombinators/Parsec/Language.o )
[24 of 25] Compiling Text.Parsec.Perm ( Text/Parsec/Perm.hs, dist/build/Text/Parsec/Perm.o )
[25 of 25] Compiling Text.ParserCombinators.Parsec.Perm ( Text/ParserCombinators/Parsec/Perm.hs, dist/build/Text/ParserCombinators/Parsec/Perm.o )
Running Haddock for parsec-3.1.11...
Running hscolour for parsec-3.1.11...
Preprocessing library parsec-3.1.11...
Preprocessing library parsec-3.1.11...
Haddock coverage:
  82% ( 14 / 17) in 'Text.Parsec.Pos'
  Missing documentation for:
    SourceName (Text/Parsec/Pos.hs:31)
    Line (Text/Parsec/Pos.hs:32)
    Column (Text/Parsec/Pos.hs:33)
  43% (  6 / 14) in 'Text.Parsec.Error'
  Missing documentation for:
    errorIsUnknown (Text/Parsec/Error.hs:113)
    showErrorMessages (Text/Parsec/Error.hs:176)
    newErrorMessage (Text/Parsec/Error.hs:123)
    newErrorUnknown (Text/Parsec/Error.hs:119)
    addErrorMessage (Text/Parsec/Error.hs:127)
    setErrorPos (Text/Parsec/Error.hs:131)
    setErrorMessage (Text/Parsec/Error.hs:135)
    mergeError (Text/Parsec/Error.hs:139)
  38% (  6 / 16) in 'Text.ParserCombinators.Parsec.Error'
  Missing documentation for:
    messageCompare (Text/ParserCombinators/Parsec/Error.hs:36)
    messageEq (Text/ParserCombinators/Parsec/Error.hs:39)
    errorIsUnknown (Text/Parsec/Error.hs:113)
    showErrorMessages (Text/Parsec/Error.hs:176)
    newErrorMessage (Text/Parsec/Error.hs:123)
    newErrorUnknown (Text/Parsec/Error.hs:119)
    addErrorMessage (Text/Parsec/Error.hs:127)
    setErrorPos (Text/Parsec/Error.hs:131)
    setErrorMessage (Text/Parsec/Error.hs:135)
    mergeError (Text/Parsec/Error.hs:139)
  64% ( 32 / 50) in 'Text.Parsec.Prim'
  Missing documentation for:
    unknownError (Text/Parsec/Prim.hs:93)
    sysUnExpectError (Text/Parsec/Prim.hs:96)
    Parsec (Text/Parsec/Prim.hs:159)
    Consumed (Text/Parsec/Prim.hs:161)
    Reply (Text/Parsec/Prim.hs:165)
    State (Text/Parsec/Prim.hs:169)
    parsecMap (Text/Parsec/Prim.hs:187)
    parserReturn (Text/Parsec/Prim.hs:231)
    parserBind (Text/Parsec/Prim.hs:236)
    mergeErrorReply (Text/Parsec/Prim.hs:276)
    parserFail (Text/Parsec/Prim.hs:282)
    parserPlus (Text/Parsec/Prim.hs:300)
    labels (Text/Parsec/Prim.hs:355)
    tokens (Text/Parsec/Prim.hs:406)
    tokenPrimEx (Text/Parsec/Prim.hs:543)
    manyAccum (Text/Parsec/Prim.hs:602)
    runPT (Text/Parsec/Prim.hs:620)
    runP (Text/Parsec/Prim.hs:634)
 100% ( 24 / 24) in 'Text.Parsec.Combinator'
 100% ( 24 / 24) in 'Text.ParserCombinators.Parsec.Combinator'
  50% (  2 /  4) in 'Text.Parsec.String'
  Missing documentation for:
    Parser (Text/Parsec/String.hs:22)
    GenParser (Text/Parsec/String.hs:23)
  50% (  2 /  4) in 'Text.Parsec.ByteString'
  Missing documentation for:
    Parser (Text/Parsec/ByteString.hs:24)
    GenParser (Text/Parsec/ByteString.hs:25)
  50% (  2 /  4) in 'Text.Parsec.ByteString.Lazy'
  Missing documentation for:
    Parser (Text/Parsec/ByteString/Lazy.hs:24)
    GenParser (Text/Parsec/ByteString/Lazy.hs:25)
  33% (  1 /  3) in 'Text.Parsec.Text'
  Missing documentation for:
    Parser (Text/Parsec/Text.hs:23)
    GenParser (Text/Parsec/Text.hs:24)
  33% (  1 /  3) in 'Text.Parsec.Text.Lazy'
  Missing documentation for:
    Parser (Text/Parsec/Text/Lazy.hs:23)
    GenParser (Text/Parsec/Text/Lazy.hs:24)
 100% (  5 /  5) in 'Text.Parsec.Expr'
  70% ( 21 / 30) in 'Text.ParserCombinators.Parsec.Prim'
  Missing documentation for:
    Parser (Text/Parsec/String.hs:22)
    GenParser (Text/Parsec/String.hs:23)
    runParser (Text/ParserCombinators/Parsec/Prim.hs:57)
    tokens (Text/Parsec/Prim.hs:406)
    tokenPrimEx (Text/Parsec/Prim.hs:543)
    try (Text/ParserCombinators/Parsec/Prim.hs:64)
    labels (Text/Parsec/Prim.hs:355)
    pzero (Text/ParserCombinators/Parsec/Prim.hs:54)
    State (Text/Parsec/Prim.hs:169)
  82% ( 14 / 17) in 'Text.ParserCombinators.Parsec.Pos'
  Missing documentation for:
    SourceName (Text/Parsec/Pos.hs:31)
    Line (Text/Parsec/Pos.hs:32)
    Column (Text/Parsec/Pos.hs:33)
 100% ( 20 / 20) in 'Text.Parsec.Char'
  67% (  4 /  6) in 'Text.Parsec.Token'
  Missing documentation for:
    LanguageDef (Text/Parsec/Token.hs:39)
    TokenParser (Text/Parsec/Token.hs:110)
  67% (  4 /  6) in 'Text.ParserCombinators.Parsec.Token'
  Missing documentation for:
    LanguageDef (Text/Parsec/Token.hs:39)
    TokenParser (Text/Parsec/Token.hs:110)
  95% ( 18 / 19) in 'Text.ParserCombinators.Parsec.Char'
  Missing documentation for:
    CharParser (Text/ParserCombinators/Parsec/Char.hs:40)
  83% ( 15 / 18) in 'Text.ParserCombinators.Parsec'
  Missing documentation for:
    SourceName (Text/Parsec/Pos.hs:31)
    Line (Text/Parsec/Pos.hs:32)
    Column (Text/Parsec/Pos.hs:33)
  40% (  2 /  5) in 'Text.ParserCombinators.Parsec.Expr'
  Missing documentation for:
    Operator (Text/ParserCombinators/Parsec/Expr.hs:29)
    OperatorTable (Text/ParserCombinators/Parsec/Expr.hs:33)
    buildExpressionParser (Text/ParserCombinators/Parsec/Expr.hs:40)
  78% ( 73 / 94) in 'Text.Parsec'
  Missing documentation for:
    Parsec (Text/Parsec/Prim.hs:159)
    tokens (Text/Parsec/Prim.hs:406)
    labels (Text/Parsec/Prim.hs:355)
    SourceName (Text/Parsec/Pos.hs:31)
    Line (Text/Parsec/Pos.hs:32)
    Column (Text/Parsec/Pos.hs:33)
    manyAccum (Text/Parsec/Prim.hs:602)
    tokenPrimEx (Text/Parsec/Prim.hs:543)
    runPT (Text/Parsec/Prim.hs:620)
    unknownError (Text/Parsec/Prim.hs:93)
    sysUnExpectError (Text/Parsec/Prim.hs:96)
    mergeErrorReply (Text/Parsec/Prim.hs:276)
    runP (Text/Parsec/Prim.hs:634)
    Consumed (Text/Parsec/Prim.hs:161)
    Reply (Text/Parsec/Prim.hs:165)
    State (Text/Parsec/Prim.hs:169)
    parsecMap (Text/Parsec/Prim.hs:187)
    parserReturn (Text/Parsec/Prim.hs:231)
    parserBind (Text/Parsec/Prim.hs:236)
    parserFail (Text/Parsec/Prim.hs:282)
    parserPlus (Text/Parsec/Prim.hs:300)
  90% (  9 / 10) in 'Text.Parsec.Language'
  Missing documentation for:
    LanguageDef (Text/Parsec/Token.hs:39)
  90% (  9 / 10) in 'Text.ParserCombinators.Parsec.Language'
  Missing documentation for:
    LanguageDef (Text/Parsec/Token.hs:39)
 100% (  8 /  8) in 'Text.Parsec.Perm'
 100% (  7 /  7) in 'Text.ParserCombinators.Parsec.Perm'
Documentation created: dist/doc/html/parsec/index.html,
dist/doc/html/parsec/parsec.txt
Creating package registration file:
/tmp/pkgConf-parsec-3.1185898342250086034.11
Installing library in
/home/builder/hackage-server/build-cache/tmp-install/lib/x86_64-linux-ghc-8.0.1.20160701/parsec-3.1.11-37j7M1YEHqtEooY7BpJdri
Registering parsec-3.1.11...
cabal: Leaving directory '/tmp/cabal-tmp-10191/parsec-3.1.11'
Installed parsec-3.1.11
cabal: Entering directory '/tmp/cabal-tmp-10191/xml-1.3.14'
Configuring xml-1.3.14...
Building xml-1.3.14...
Preprocessing library xml-1.3.14...
[1 of 7] Compiling Text.XML.Light.Types ( Text/XML/Light/Types.hs, dist/build/Text/XML/Light/Types.o )
[2 of 7] Compiling Text.XML.Light.Proc ( Text/XML/Light/Proc.hs, dist/build/Text/XML/Light/Proc.o )
[3 of 7] Compiling Text.XML.Light.Output ( Text/XML/Light/Output.hs, dist/build/Text/XML/Light/Output.o )
[4 of 7] Compiling Text.XML.Light.Lexer ( Text/XML/Light/Lexer.hs, dist/build/Text/XML/Light/Lexer.o )

Text/XML/Light/Lexer.hs:119:1: warning: [-Wtabs]
    Tab character found here, and in one further location.
    Please use spaces instead.
[5 of 7] Compiling Text.XML.Light.Input ( Text/XML/Light/Input.hs, dist/build/Text/XML/Light/Input.o )
[6 of 7] Compiling Text.XML.Light.Cursor ( Text/XML/Light/Cursor.hs, dist/build/Text/XML/Light/Cursor.o )
[7 of 7] Compiling Text.XML.Light   ( Text/XML/Light.hs, dist/build/Text/XML/Light.o )
Running Haddock for xml-1.3.14...
Running hscolour for xml-1.3.14...
Preprocessing library xml-1.3.14...
Preprocessing library xml-1.3.14...

Text/XML/Light/Lexer.hs:119:1: warning: [-Wtabs]
    Tab character found here, and in one further location.
    Please use spaces instead.
Haddock coverage:
  77% ( 10 / 13) in 'Text.XML.Light.Types'
  Missing documentation for:
    CDataKind (Text/XML/Light/Types.hs:50)
     (Text/XML/Light/Types.hs:64)
     (Text/XML/Light/Types.hs:67)
 100% ( 21 / 21) in 'Text.XML.Light.Proc'
  65% ( 13 / 20) in 'Text.XML.Light.Output'
  Missing documentation for:
    showContent (Text/XML/Light/Output.hs:140)
    showElement (Text/XML/Light/Output.hs:143)
    showCData (Text/XML/Light/Output.hs:146)
    showQName (Text/XML/Light/Output.hs:198)
    showAttr (Text/XML/Light/Output.hs:195)
    ConfigPP (Text/XML/Light/Output.hs:34)
    tagEnd (Text/XML/Light/Output.hs:188)
   9% (  3 / 32) in 'Text.XML.Light.Lexer'
  Missing documentation for:
    Module header
    XmlSource (Text/XML/Light/Lexer.hs:15)
     (Text/XML/Light/Lexer.hs:18)
     (Text/XML/Light/Lexer.hs:22)
     (Text/XML/Light/Lexer.hs:26)
     (Text/XML/Light/Lexer.hs:30)
     (Text/XML/Light/Lexer.hs:33)
    linenumber (Text/XML/Light/Lexer.hs:36)
     (Text/XML/Light/Lexer.hs:57)
    LChar (Text/XML/Light/Lexer.hs:64)
    LString (Text/XML/Light/Lexer.hs:65)
    Token (Text/XML/Light/Lexer.hs:66)
    tokens (Text/XML/Light/Lexer.hs:72)
    tokens' (Text/XML/Light/Lexer.hs:75)
    special (Text/XML/Light/Lexer.hs:96)
    qualName (Text/XML/Light/Lexer.hs:128)
    tag (Text/XML/Light/Lexer.hs:140)
    attribs (Text/XML/Light/Lexer.hs:151)
    attrib (Text/XML/Light/Lexer.hs:169)
    attr_val (Text/XML/Light/Lexer.hs:174)
    dropSpace (Text/XML/Light/Lexer.hs:179)
    break' (Text/XML/Light/Lexer.hs:195)
    breakn (Text/XML/Light/Lexer.hs:201)
    decode_attr (Text/XML/Light/Lexer.hs:206)
    Txt (Text/XML/Light/Lexer.hs:213)
    decode_text (Text/XML/Light/Lexer.hs:215)
    cref_to_char (Text/XML/Light/Lexer.hs:223)
    num_esc (Text/XML/Light/Lexer.hs:233)
    cvt_char (Text/XML/Light/Lexer.hs:241)
 100% (  3 /  3) in 'Text.XML.Light.Input'
  90% ( 45 / 50) in 'Text.XML.Light.Cursor'
  Missing documentation for:
    Tag (Text/XML/Light/Cursor.hs:76)
    getTag (Text/XML/Light/Cursor.hs:81)
    setTag (Text/XML/Light/Cursor.hs:87)
    fromTag (Text/XML/Light/Cursor.hs:90)
    Path (Text/XML/Light/Cursor.hs:97)
  32% ( 10 / 31) in 'Text.XML.Light'
  Missing documentation for:
     (Text/XML/Light.hs:57)
     (Text/XML/Light.hs:63)
     (Text/XML/Light.hs:64)
     (Text/XML/Light.hs:65)
     (Text/XML/Light.hs:67)
     (Text/XML/Light.hs:68)
     (Text/XML/Light.hs:69)
     (Text/XML/Light.hs:70)
     (Text/XML/Light.hs:72)
     (Text/XML/Light.hs:75)
     (Text/XML/Light.hs:76)
     (Text/XML/Light.hs:77)
     (Text/XML/Light.hs:78)
     (Text/XML/Light.hs:80)
     (Text/XML/Light.hs:83)
     (Text/XML/Light.hs:84)
     (Text/XML/Light.hs:85)
     (Text/XML/Light.hs:86)
     (Text/XML/Light.hs:88)
     (Text/XML/Light.hs:91)
     (Text/XML/Light.hs:92)
Documentation created: dist/doc/html/xml/index.html, dist/doc/html/xml/xml.txt
Creating package registration file: /tmp/pkgConf-xml-1.32941512491540836825.14
Installing library in
/home/builder/hackage-server/build-cache/tmp-install/lib/x86_64-linux-ghc-8.0.1.20160701/xml-1.3.14-3zYl5R5RzXQ1BYD85LizEl
Registering xml-1.3.14...
cabal: Leaving directory '/tmp/cabal-tmp-10191/xml-1.3.14'
Installed xml-1.3.14
cabal: Entering directory '/tmp/cabal-tmp-10191/MonadRandom-0.4.2.3'
Configuring MonadRandom-0.4.2.3...
Building MonadRandom-0.4.2.3...
Preprocessing library MonadRandom-0.4.2.3...
[1 of 2] Compiling Control.Monad.Random.Class ( Control/Monad/Random/Class.hs, dist/build/Control/Monad/Random/Class.o )
[2 of 2] Compiling Control.Monad.Random ( Control/Monad/Random.hs, dist/build/Control/Monad/Random.o )

Control/Monad/Random.hs:54:1: warning: [-Wdeprecations]
    Module ‘Control.Monad.Error’ is deprecated:
      Use Control.Monad.Except instead

Control/Monad/Random.hs:206:11: warning: [-Wdeprecations]
    In the use of type constructor or class ‘Error’
    (imported from Control.Monad.Error, but defined in Control.Monad.Trans.Error):
    Deprecated: "Use Control.Monad.Trans.Except instead"

Control/Monad/Random.hs:206:51: warning: [-Wdeprecations]
    In the use of type constructor or class ‘ErrorT’
    (imported from Control.Monad.Error, but defined in Control.Monad.Trans.Error):
    Deprecated: "Use Control.Monad.Trans.Except instead"

Control/Monad/Random.hs:251:11: warning: [-Wdeprecations]
    In the use of type constructor or class ‘Error’
    (imported from Control.Monad.Error, but defined in Control.Monad.Trans.Error):
    Deprecated: "Use Control.Monad.Trans.Except instead"

Control/Monad/Random.hs:251:53: warning: [-Wdeprecations]
    In the use of type constructor or class ‘ErrorT’
    (imported from Control.Monad.Error, but defined in Control.Monad.Trans.Error):
    Deprecated: "Use Control.Monad.Trans.Except instead"
Running Haddock for MonadRandom-0.4.2.3...
Running hscolour for MonadRandom-0.4.2.3...
Preprocessing library MonadRandom-0.4.2.3...
Preprocessing library MonadRandom-0.4.2.3...

Control/Monad/Random.hs:54:1: warning: [-Wdeprecations]
    Module ‘Control.Monad.Error’ is deprecated:
      Use Control.Monad.Except instead

Control/Monad/Random.hs:206:11: warning: [-Wdeprecations]
    In the use of type constructor or class ‘Error’
    (imported from Control.Monad.Error, but defined in Control.Monad.Trans.Error):
    Deprecated: "Use Control.Monad.Trans.Except instead"

Control/Monad/Random.hs:206:51: warning: [-Wdeprecations]
    In the use of type constructor or class ‘ErrorT’
    (imported from Control.Monad.Error, but defined in Control.Monad.Trans.Error):
    Deprecated: "Use Control.Monad.Trans.Except instead"

Control/Monad/Random.hs:251:11: warning: [-Wdeprecations]
    In the use of type constructor or class ‘Error’
    (imported from Control.Monad.Error, but defined in Control.Monad.Trans.Error):
    Deprecated: "Use Control.Monad.Trans.Except instead"

Control/Monad/Random.hs:251:53: warning: [-Wdeprecations]
    In the use of type constructor or class ‘ErrorT’
    (imported from Control.Monad.Error, but defined in Control.Monad.Trans.Error):
    Deprecated: "Use Control.Monad.Trans.Except instead"
Haddock coverage:
  88% (  7 /  8) in 'Control.Monad.Random.Class'
  Missing documentation for:
    getSplit (Control/Monad/Random/Class.hs:49)
 100% ( 17 / 17) in 'Control.Monad.Random'
Documentation created: dist/doc/html/MonadRandom/index.html,
dist/doc/html/MonadRandom/MonadRandom.txt
Creating package registration file:
/tmp/pkgConf-MonadRandom-0.4.2598845591262458924.3
Installing library in
/home/builder/hackage-server/build-cache/tmp-install/lib/x86_64-linux-ghc-8.0.1.20160701/MonadRandom-0.4.2.3-BeY4MXl2TWH5X5ex76pU0B
Registering MonadRandom-0.4.2.3...
cabal: Leaving directory '/tmp/cabal-tmp-10191/MonadRandom-0.4.2.3'
Installed MonadRandom-0.4.2.3
cabal: Entering directory '/tmp/cabal-tmp-10191/network-bytestring-0.1.1.2'
Configuring network-bytestring-0.1.1.2...
Building network-bytestring-0.1.1.2...
Preprocessing library network-bytestring-0.1.1.2...

In file included from <command-line>:13:0: error: 

/tmp/ghc15955_0/ghc_2.h:247:0: error:
     warning: "VERSION_network" redefined [enabled by default]
     #define VERSION_network "2.6.2.1"
     ^

In file included from <command-line>:13:0: error: 

dist/build/autogen/cabal_macros.h:32:0: error:
     note: this is the location of the previous definition
     #define VERSION_network "2.6.3.1"
     ^

In file included from <command-line>:13:0: error: 

/tmp/ghc15955_0/ghc_2.h:248:0: error:
     warning: "MIN_VERSION_network" redefined [enabled by default]
     #define MIN_VERSION_network(major1,major2,minor) (\
     ^

In file included from <command-line>:13:0: error: 

dist/build/autogen/cabal_macros.h:33:0: error:
     note: this is the location of the previous definition
     #define MIN_VERSION_network(major1,major2,minor) (\
     ^
[1 of 1] Compiling Network.Socket.ByteString ( dist/build/Network/Socket/ByteString.hs, dist/build/Network/Socket/ByteString.o )

Network/Socket/ByteString.cpphs:51:1: error:
    Failed to load interface for ‘GHC.IOBase’
    Perhaps you meant GHC.Base (from base-4.9.0.0)
    Use -v to see a list of the files searched for.
cabal: Leaving directory '/tmp/cabal-tmp-10191/network-bytestring-0.1.1.2'
Failed to install network-bytestring-0.1.1.2
cabal: Entering directory '/tmp/cabal-tmp-10191/regex-posix-0.95.2'
Configuring regex-posix-0.95.2...
Building regex-posix-0.95.2...
Preprocessing library regex-posix-0.95.2...
[1 of 6] Compiling Text.Regex.Posix.Wrap ( dist/build/Text/Regex/Posix/Wrap.hs, dist/build/Text/Regex/Posix/Wrap.o )
[2 of 6] Compiling Text.Regex.Posix.String ( Text/Regex/Posix/String.hs, dist/build/Text/Regex/Posix/String.o )
[3 of 6] Compiling Text.Regex.Posix.Sequence ( Text/Regex/Posix/Sequence.hs, dist/build/Text/Regex/Posix/Sequence.o )
[4 of 6] Compiling Text.Regex.Posix.ByteString ( Text/Regex/Posix/ByteString.hs, dist/build/Text/Regex/Posix/ByteString.o )
[5 of 6] Compiling Text.Regex.Posix.ByteString.Lazy ( Text/Regex/Posix/ByteString/Lazy.hs, dist/build/Text/Regex/Posix/ByteString/Lazy.o )
[6 of 6] Compiling Text.Regex.Posix ( Text/Regex/Posix.hs, dist/build/Text/Regex/Posix.o )

Text/Regex/Posix.hs:72:13: warning: [-Wdeprecations]
    In the use of ‘versionTags’ (imported from Data.Version):
    Deprecated: "See GHC ticket #2496"
Running Haddock for regex-posix-0.95.2...
Running hscolour for regex-posix-0.95.2...
Preprocessing library regex-posix-0.95.2...
Preprocessing library regex-posix-0.95.2...

Text/Regex/Posix.hs:72:13: warning: [-Wdeprecations]
    In the use of ‘versionTags’ (imported from Data.Version):
    Deprecated: "See GHC ticket #2496"
Haddock coverage:
  40% ( 17 / 42) in 'Text.Regex.Posix.Wrap'
  Missing documentation for:
    RegOffsetT (Text/Regex/Posix/Wrap.hsc:166)
    =~ (Text/Regex/Posix/Wrap.hsc:320)
    =~~ (Text/Regex/Posix/Wrap.hsc:322)
    wrapCompile (Text/Regex/Posix/Wrap.hsc:298)
    wrapTest (Text/Regex/Posix/Wrap.hsc:303)
    wrapCount (Text/Regex/Posix/Wrap.hsc:317)
    unusedRegOffset (Text/Regex/Posix/Wrap.hsc:291)
    compExtended (Text/Regex/Posix/Wrap.hsc:416)
    compIgnoreCase (Text/Regex/Posix/Wrap.hsc:418)
    compNoSub (Text/Regex/Posix/Wrap.hsc:420)
    compNewline (Text/Regex/Posix/Wrap.hsc:422)
    execNotBOL (Text/Regex/Posix/Wrap.hsc:411)
    execNotEOL (Text/Regex/Posix/Wrap.hsc:413)
    retBadbr (Text/Regex/Posix/Wrap.hsc:427)
    retBadpat (Text/Regex/Posix/Wrap.hsc:429)
    retBadrpt (Text/Regex/Posix/Wrap.hsc:431)
    retEcollate (Text/Regex/Posix/Wrap.hsc:433)
    retEctype (Text/Regex/Posix/Wrap.hsc:435)
    retEescape (Text/Regex/Posix/Wrap.hsc:437)
    retEsubreg (Text/Regex/Posix/Wrap.hsc:439)
    retEbrack (Text/Regex/Posix/Wrap.hsc:441)
    retEparen (Text/Regex/Posix/Wrap.hsc:443)
    retEbrace (Text/Regex/Posix/Wrap.hsc:445)
    retErange (Text/Regex/Posix/Wrap.hsc:447)
    retEspace (Text/Regex/Posix/Wrap.hsc:449)
  68% ( 17 / 25) in 'Text.Regex.Posix.String'
  Missing documentation for:
    unusedOffset (Text/Regex/Posix/String.hs:63)
    compile (Text/Regex/Posix/String.hs:87)
    compExtended (Text/Regex/Posix/Wrap.hsc:416)
    compIgnoreCase (Text/Regex/Posix/Wrap.hsc:418)
    compNoSub (Text/Regex/Posix/Wrap.hsc:420)
    compNewline (Text/Regex/Posix/Wrap.hsc:422)
    execNotBOL (Text/Regex/Posix/Wrap.hsc:411)
    execNotEOL (Text/Regex/Posix/Wrap.hsc:413)
  67% ( 16 / 24) in 'Text.Regex.Posix.Sequence'
  Missing documentation for:
    unusedOffset (Text/Regex/Posix/Sequence.hs:67)
    compile (Text/Regex/Posix/Sequence.hs:91)
    compExtended (Text/Regex/Posix/Wrap.hsc:416)
    compIgnoreCase (Text/Regex/Posix/Wrap.hsc:418)
    compNoSub (Text/Regex/Posix/Wrap.hsc:420)
    compNewline (Text/Regex/Posix/Wrap.hsc:422)
    execNotBOL (Text/Regex/Posix/Wrap.hsc:411)
    execNotEOL (Text/Regex/Posix/Wrap.hsc:413)
  68% ( 17 / 25) in 'Text.Regex.Posix.ByteString'
  Missing documentation for:
    unusedOffset (Text/Regex/Posix/ByteString.hs:143)
    regexec (Text/Regex/Posix/ByteString.hs:124)
    compExtended (Text/Regex/Posix/Wrap.hsc:416)
    compIgnoreCase (Text/Regex/Posix/Wrap.hsc:418)
    compNoSub (Text/Regex/Posix/Wrap.hsc:420)
    compNewline (Text/Regex/Posix/Wrap.hsc:422)
    execNotBOL (Text/Regex/Posix/Wrap.hsc:411)
    execNotEOL (Text/Regex/Posix/Wrap.hsc:413)
  68% ( 17 / 25) in 'Text.Regex.Posix.ByteString.Lazy'
  Missing documentation for:
    unusedOffset (Text/Regex/Posix/ByteString/Lazy.hs:140)
    regexec (Text/Regex/Posix/ByteString/Lazy.hs:128)
    compExtended (Text/Regex/Posix/Wrap.hsc:416)
    compIgnoreCase (Text/Regex/Posix/Wrap.hsc:418)
    compNoSub (Text/Regex/Posix/Wrap.hsc:420)
    compNewline (Text/Regex/Posix/Wrap.hsc:422)
    execNotBOL (Text/Regex/Posix/Wrap.hsc:411)
    execNotEOL (Text/Regex/Posix/Wrap.hsc:413)
  80% (  4 /  5) in 'Text.Regex.Posix'
  Missing documentation for:
    getVersion_Text_Regex_Posix (Text/Regex/Posix.hs:69)
Warning: Text.Regex.Posix.Wrap: could not find link destinations for:
    retNoMatch
Warning: Text.Regex.Posix.String: could not find link destinations for:
    retNoMatch
Warning: Text.Regex.Posix.Sequence: could not find link destinations for:
    retNoMatch
Warning: Text.Regex.Posix.ByteString: could not find link destinations for:
    retNoMatch
Warning: Text.Regex.Posix.ByteString.Lazy: could not find link destinations for:
    retNoMatch
Documentation created: dist/doc/html/regex-posix/index.html,
dist/doc/html/regex-posix/regex-posix.txt
Creating package registration file:
/tmp/pkgConf-regex-posix-0.9520435884741513453188.2
Installing library in
/home/builder/hackage-server/build-cache/tmp-install/lib/x86_64-linux-ghc-8.0.1.20160701/regex-posix-0.95.2-BbcuFE4RwTG3oQUmzAVjm
Registering regex-posix-0.95.2...
cabal: Leaving directory '/tmp/cabal-tmp-10191/regex-posix-0.95.2'
Installed regex-posix-0.95.2
cabal: Entering directory '/tmp/cabal-tmp-10191/QuickCheck-2.9.2'
Configuring QuickCheck-2.9.2...
Building QuickCheck-2.9.2...
Preprocessing library QuickCheck-2.9.2...
[ 1 of 15] Compiling Test.QuickCheck.Random ( Test/QuickCheck/Random.hs, dist/build/Test/QuickCheck/Random.o )
[ 2 of 15] Compiling Test.QuickCheck.Exception ( Test/QuickCheck/Exception.hs, dist/build/Test/QuickCheck/Exception.o )
[ 3 of 15] Compiling Test.QuickCheck.Text ( Test/QuickCheck/Text.hs, dist/build/Test/QuickCheck/Text.o )
[ 4 of 15] Compiling Test.QuickCheck.State ( Test/QuickCheck/State.hs, dist/build/Test/QuickCheck/State.o )
[ 5 of 15] Compiling Test.QuickCheck.Gen ( Test/QuickCheck/Gen.hs, dist/build/Test/QuickCheck/Gen.o )
[ 6 of 15] Compiling Test.QuickCheck.Gen.Unsafe ( Test/QuickCheck/Gen/Unsafe.hs, dist/build/Test/QuickCheck/Gen/Unsafe.o )
[ 7 of 15] Compiling Test.QuickCheck.Arbitrary ( Test/QuickCheck/Arbitrary.hs, dist/build/Test/QuickCheck/Arbitrary.o )
[ 8 of 15] Compiling Test.QuickCheck.Modifiers ( Test/QuickCheck/Modifiers.hs, dist/build/Test/QuickCheck/Modifiers.o )
[ 9 of 15] Compiling Test.QuickCheck.Poly ( Test/QuickCheck/Poly.hs, dist/build/Test/QuickCheck/Poly.o )
[10 of 15] Compiling Test.QuickCheck.Function ( Test/QuickCheck/Function.hs, dist/build/Test/QuickCheck/Function.o )
[11 of 15] Compiling Test.QuickCheck.Property ( Test/QuickCheck/Property.hs, dist/build/Test/QuickCheck/Property.o )
[12 of 15] Compiling Test.QuickCheck.Test ( Test/QuickCheck/Test.hs, dist/build/Test/QuickCheck/Test.o )
[13 of 15] Compiling Test.QuickCheck.All ( Test/QuickCheck/All.hs, dist/build/Test/QuickCheck/All.o )
[14 of 15] Compiling Test.QuickCheck.Monadic ( Test/QuickCheck/Monadic.hs, dist/build/Test/QuickCheck/Monadic.o )
[15 of 15] Compiling Test.QuickCheck  ( Test/QuickCheck.hs, dist/build/Test/QuickCheck.o )
Running Haddock for QuickCheck-2.9.2...
Running hscolour for QuickCheck-2.9.2...
Preprocessing library QuickCheck-2.9.2...
Preprocessing library QuickCheck-2.9.2...
Haddock coverage:
  10% (  2 / 20) in 'Test.QuickCheck.Random'
  Missing documentation for:
    newTheGen (Test/QuickCheck/Random.hs:17)
    bits (Test/QuickCheck/Random.hs:20)
    mask (Test/QuickCheck/Random.hs:20)
    doneBit (Test/QuickCheck/Random.hs:20)
    chip (Test/QuickCheck/Random.hs:25)
    chop (Test/QuickCheck/Random.hs:30)
    stop (Test/QuickCheck/Random.hs:33)
    mkTheGen (Test/QuickCheck/Random.hs:36)
     (Test/QuickCheck/Random.hs:65)
     (Test/QuickCheck/Random.hs:67)
     (Test/QuickCheck/Random.hs:70)
    newQCGen (Test/QuickCheck/Random.hs:79)
    mkQCGen (Test/QuickCheck/Random.hs:82)
    bigNatVariant (Test/QuickCheck/Random.hs:85)
    natVariant (Test/QuickCheck/Random.hs:91)
    variantTheGen (Test/QuickCheck/Random.hs:97)
    boolVariant (Test/QuickCheck/Random.hs:103)
    variantQCGen (Test/QuickCheck/Random.hs:107)
  33% (  3 /  9) in 'Test.QuickCheck.Exception'
  Missing documentation for:
    AnException (Test/QuickCheck/Exception.hs:23)
    tryEvaluate (Test/QuickCheck/Exception.hs:55)
    tryEvaluateIO (Test/QuickCheck/Exception.hs:58)
    evaluate (Test/QuickCheck/Exception.hs:62)
    isDiscard (Test/QuickCheck/Exception.hs:81)
    finally (Test/QuickCheck/Exception.hs:96)
   6% (  1 / 18) in 'Test.QuickCheck.Text'
  Missing documentation for:
    Str (Test/QuickCheck/Text.hs:47)
    ranges (Test/QuickCheck/Text.hs:52)
    number (Test/QuickCheck/Text.hs:60)
    short (Test/QuickCheck/Text.hs:63)
    showErr (Test/QuickCheck/Text.hs:71)
    oneLine (Test/QuickCheck/Text.hs:74)
    isOneLine (Test/QuickCheck/Text.hs:77)
    bold (Test/QuickCheck/Text.hs:80)
    newTerminal (Test/QuickCheck/Text.hs:91)
    withStdioTerminal (Test/QuickCheck/Text.hs:105)
    withNullTerminal (Test/QuickCheck/Text.hs:111)
    terminalOutput (Test/QuickCheck/Text.hs:115)
    handle (Test/QuickCheck/Text.hs:118)
    Terminal (Test/QuickCheck/Text.hs:88)
    putTemp (Test/QuickCheck/Text.hs:129)
    putPart (Test/QuickCheck/Text.hs:129)
    putLine (Test/QuickCheck/Text.hs:129)
 100% (  2 /  2) in 'Test.QuickCheck.State'
  90% ( 26 / 29) in 'Test.QuickCheck.Gen'
  Missing documentation for:
     (Test/QuickCheck/Gen.hs:49)
     (Test/QuickCheck/Gen.hs:53)
     (Test/QuickCheck/Gen.hs:57)
  80% (  4 /  5) in 'Test.QuickCheck.Gen.Unsafe'
  Missing documentation for:
    Capture (Test/QuickCheck/Gen/Unsafe.hs:50)
 100% ( 31 / 31) in 'Test.QuickCheck.Arbitrary'
  93% ( 14 / 15) in 'Test.QuickCheck.Modifiers'
  Missing documentation for:
    ShrinkState (Test/QuickCheck/Modifiers.hs:323)
  14% (  1 /  7) in 'Test.QuickCheck.Poly'
  Missing documentation for:
    A (Test/QuickCheck/Poly.hs:29)
    B (Test/QuickCheck/Poly.hs:44)
    C (Test/QuickCheck/Poly.hs:59)
    OrdA (Test/QuickCheck/Poly.hs:77)
    OrdB (Test/QuickCheck/Poly.hs:96)
    OrdC (Test/QuickCheck/Poly.hs:115)
  73% (  8 / 11) in 'Test.QuickCheck.Function'
  Missing documentation for:
    Fun (Test/QuickCheck/Function.hs:452)
    apply (Test/QuickCheck/Function.hs:466)
    Function (Test/QuickCheck/Function.hs:138)
  62% ( 45 / 72) in 'Test.QuickCheck.Property'
  Missing documentation for:
     (Test/QuickCheck/Property.hs:81)
     (Test/QuickCheck/Property.hs:84)
     (Test/QuickCheck/Property.hs:87)
     (Test/QuickCheck/Property.hs:90)
     (Test/QuickCheck/Property.hs:93)
     (Test/QuickCheck/Property.hs:96)
     (Test/QuickCheck/Property.hs:118)
    protect (Test/QuickCheck/Property.hs:122)
    Prop (Test/QuickCheck/Property.hs:128)
    Rose (Test/QuickCheck/Property.hs:132)
    ioRose (Test/QuickCheck/Property.hs:135)
    joinRose (Test/QuickCheck/Property.hs:138)
     (Test/QuickCheck/Property.hs:147)
     (Test/QuickCheck/Property.hs:152)
     (Test/QuickCheck/Property.hs:157)
    CallbackKind (Test/QuickCheck/Property.hs:191)
    exception (Test/QuickCheck/Property.hs:207)
    formatException (Test/QuickCheck/Property.hs:213)
    protectResult (Test/QuickCheck/Property.hs:218)
    succeeded (Test/QuickCheck/Property.hs:221)
    failed (Test/QuickCheck/Property.hs:221)
    rejected (Test/QuickCheck/Property.hs:221)
    liftBool (Test/QuickCheck/Property.hs:242)
    mapResult (Test/QuickCheck/Property.hs:246)
    mapTotalResult (Test/QuickCheck/Property.hs:249)
    mapRoseResult (Test/QuickCheck/Property.hs:253)
    mapProp (Test/QuickCheck/Property.hs:256)
  50% ( 14 / 28) in 'Test.QuickCheck.Test'
  Missing documentation for:
    test (Test/QuickCheck/Test.hs:193)
    doneTesting (Test/QuickCheck/Test.hs:199)
    giveUp (Test/QuickCheck/Test.hs:229)
    runATest (Test/QuickCheck/Test.hs:245)
    summary (Test/QuickCheck/Test.hs:311)
    success (Test/QuickCheck/Test.hs:322)
    labelPercentage (Test/QuickCheck/Test.hs:352)
    insufficientCoverage (Test/QuickCheck/Test.hs:360)
    foundFailure (Test/QuickCheck/Test.hs:367)
    localMin (Test/QuickCheck/Test.hs:371)
    localMin' (Test/QuickCheck/Test.hs:401)
    localMinFound (Test/QuickCheck/Test.hs:413)
    callbackPostTest (Test/QuickCheck/Test.hs:438)
    callbackPostFinalFailure (Test/QuickCheck/Test.hs:443)
 100% (  9 /  9) in 'Test.QuickCheck.All'
  78% ( 14 / 18) in 'Test.QuickCheck.Monadic'
  Missing documentation for:
    stop (Test/QuickCheck/Monadic.hs:118)
    monadic (Test/QuickCheck/Monadic.hs:204)
    monadic' (Test/QuickCheck/Monadic.hs:207)
    runSTGen (Test/QuickCheck/Monadic.hs:246)
  99% (127 /128) in 'Test.QuickCheck'
  Missing documentation for:
    ShrinkState (Test/QuickCheck/Modifiers.hs:323)
Warning: Test.QuickCheck.Arbitrary: could not find link destinations for:
    GCoArbitrary RecursivelyShrink GSubterms gSubterms gSubtermsIncl
Warning: Test.QuickCheck.Function: could not find link destinations for:
    GFunction
Warning: Test.QuickCheck: could not find link destinations for:
    GCoArbitrary RecursivelyShrink GSubterms
Documentation created: dist/doc/html/QuickCheck/index.html,
dist/doc/html/QuickCheck/QuickCheck.txt
Creating package registration file:
/tmp/pkgConf-QuickCheck-2.9522359337976350310.2
Installing library in
/home/builder/hackage-server/build-cache/tmp-install/lib/x86_64-linux-ghc-8.0.1.20160701/QuickCheck-2.9.2-AzbjWrJo3WFD60ZxKurQ3s
Registering QuickCheck-2.9.2...
cabal: Leaving directory '/tmp/cabal-tmp-10191/QuickCheck-2.9.2'
Installed QuickCheck-2.9.2
cabal: Entering directory '/tmp/cabal-tmp-10191/scientific-0.3.4.9'
Configuring scientific-0.3.4.9...
Building scientific-0.3.4.9...
Preprocessing library scientific-0.3.4.9...
[1 of 7] Compiling GHC.Integer.Logarithms.Compat ( src/GHC/Integer/Logarithms/Compat.hs, dist/build/GHC/Integer/Logarithms/Compat.o )
[2 of 7] Compiling GHC.Integer.Compat ( src/GHC/Integer/Compat.hs, dist/build/GHC/Integer/Compat.o )
[3 of 7] Compiling Math.NumberTheory.Logarithms ( src/Math/NumberTheory/Logarithms.hs, dist/build/Math/NumberTheory/Logarithms.o )
[4 of 7] Compiling Utils            ( src/Utils.hs, dist/build/Utils.o )
[5 of 7] Compiling Data.Scientific  ( src/Data/Scientific.hs, dist/build/Data/Scientific.o )
[6 of 7] Compiling Data.Text.Lazy.Builder.Scientific ( src/Data/Text/Lazy/Builder/Scientific.hs, dist/build/Data/Text/Lazy/Builder/Scientific.o )
[7 of 7] Compiling Data.ByteString.Builder.Scientific ( src/Data/ByteString/Builder/Scientific.hs, dist/build/Data/ByteString/Builder/Scientific.o )
Running Haddock for scientific-0.3.4.9...
Running hscolour for scientific-0.3.4.9...
Preprocessing library scientific-0.3.4.9...
Preprocessing library scientific-0.3.4.9...
Haddock coverage:
  67% (  2 /  3) in 'GHC.Integer.Logarithms.Compat'
  Missing documentation for:
    Module header
   0% (  0 /  2) in 'GHC.Integer.Compat'
  Missing documentation for:
    Module header
    divInteger
 100% (  2 /  2) in 'Math.NumberTheory.Logarithms'
  33% (  1 /  3) in 'Utils'
  Missing documentation for:
    Module header
    roundTo (src/Utils.hs:12)
 100% ( 24 / 24) in 'Data.Scientific'
  75% (  3 /  4) in 'Data.Text.Lazy.Builder.Scientific'
  Missing documentation for:
    Module header
  75% (  3 /  4) in 'Data.ByteString.Builder.Scientific'
  Missing documentation for:
    Module header
Warning: Data.Scientific: could not find link destinations for:
    whenFloating
Documentation created: dist/doc/html/scientific/index.html,
dist/doc/html/scientific/scientific.txt
Creating package registration file:
/tmp/pkgConf-scientific-0.3.418863862161476131424.9
Installing library in
/home/builder/hackage-server/build-cache/tmp-install/lib/x86_64-linux-ghc-8.0.1.20160701/scientific-0.3.4.9-JxsEP2U97KeHjUTI8Fv24j
Registering scientific-0.3.4.9...
cabal: Leaving directory '/tmp/cabal-tmp-10191/scientific-0.3.4.9'
Installed scientific-0.3.4.9
cabal: Entering directory '/tmp/cabal-tmp-10191/network-uri-2.6.1.0'
Configuring network-uri-2.6.1.0...
Building network-uri-2.6.1.0...
Preprocessing library network-uri-2.6.1.0...
[1 of 1] Compiling Network.URI      ( Network/URI.hs, dist/build/Network/URI.o )
Running Haddock for network-uri-2.6.1.0...
Running hscolour for network-uri-2.6.1.0...
Preprocessing library network-uri-2.6.1.0...
Preprocessing library network-uri-2.6.1.0...
Haddock coverage:
  78% ( 39 / 50) in 'Network.URI'
  Missing documentation for:
    uriIsAbsolute (Network/URI.hs:321)
    uriIsRelative (Network/URI.hs:324)
    parseabsoluteURI (Network/URI.hs:1284)
    escapeString (Network/URI.hs:1288)
    reserved (Network/URI.hs:1292)
    unreserved (Network/URI.hs:1296)
    scheme (Network/URI.hs:1302)
    authority (Network/URI.hs:1306)
    path (Network/URI.hs:1314)
    query (Network/URI.hs:1318)
    fragment (Network/URI.hs:1322)
Documentation created: dist/doc/html/network-uri/index.html,
dist/doc/html/network-uri/network-uri.txt
Creating package registration file:
/tmp/pkgConf-network-uri-2.6.116754393791001271361.0
Installing library in
/home/builder/hackage-server/build-cache/tmp-install/lib/x86_64-linux-ghc-8.0.1.20160701/network-uri-2.6.1.0-6PuDgH21OiwGLI4QZ1g9kt
Registering network-uri-2.6.1.0...
cabal: Leaving directory '/tmp/cabal-tmp-10191/network-uri-2.6.1.0'
Installed network-uri-2.6.1.0
cabal: Entering directory '/tmp/cabal-tmp-10191/random-shuffle-0.0.4'
Configuring random-shuffle-0.0.4...
Building random-shuffle-0.0.4...
Preprocessing library random-shuffle-0.0.4...
[1 of 1] Compiling System.Random.Shuffle ( src/System/Random/Shuffle.hs, dist/build/System/Random/Shuffle.o )

src/System/Random/Shuffle.hs:59:1: warning: [-Wtabs]
    Tab character found here, and in 10 further locations.
    Please use spaces instead.
Running Haddock for random-shuffle-0.0.4...
Running hscolour for random-shuffle-0.0.4...
Preprocessing library random-shuffle-0.0.4...
Preprocessing library random-shuffle-0.0.4...

src/System/Random/Shuffle.hs:59:1: warning: [-Wtabs]
    Tab character found here, and in 10 further locations.
    Please use spaces instead.
Haddock coverage:
 100% (  4 /  4) in 'System.Random.Shuffle'
Documentation created: dist/doc/html/random-shuffle/index.html,
dist/doc/html/random-shuffle/random-shuffle.txt
Creating package registration file:
/tmp/pkgConf-random-shuffle-0.09145601161589147732.4
Installing library in
/home/builder/hackage-server/build-cache/tmp-install/lib/x86_64-linux-ghc-8.0.1.20160701/random-shuffle-0.0.4-4HPj3K38ghl6zBNCA2I5Iy
Registering random-shuffle-0.0.4...
cabal: Leaving directory '/tmp/cabal-tmp-10191/random-shuffle-0.0.4'
Installed random-shuffle-0.0.4
cabal: Entering directory '/tmp/cabal-tmp-10191/test-framework-0.8.1.1'
Configuring test-framework-0.8.1.1...
Building test-framework-0.8.1.1...
Preprocessing library test-framework-0.8.1.1...
[ 1 of 24] Compiling Test.Framework.Runners.ThreadPool ( Test/Framework/Runners/ThreadPool.hs, dist/build/Test/Framework/Runners/ThreadPool.o )
[ 2 of 24] Compiling Test.Framework.Runners.Console.Utilities ( Test/Framework/Runners/Console/Utilities.hs, dist/build/Test/Framework/Runners/Console/Utilities.o )
[ 3 of 24] Compiling Test.Framework.Runners.Console.ProgressBar ( Test/Framework/Runners/Console/ProgressBar.hs, dist/build/Test/Framework/Runners/Console/ProgressBar.o )
[ 4 of 24] Compiling Test.Framework.Runners.Console.Colors ( Test/Framework/Runners/Console/Colors.hs, dist/build/Test/Framework/Runners/Console/Colors.o )
[ 5 of 24] Compiling Test.Framework.Runners.Processors ( Test/Framework/Runners/Processors.hs, dist/build/Test/Framework/Runners/Processors.o )
[ 6 of 24] Compiling Test.Framework.Improving ( Test/Framework/Improving.hs, dist/build/Test/Framework/Improving.o )

Test/Framework/Improving.hs:9:1: warning: [-Wunused-imports]
    The import of ‘Control.Applicative’ is redundant
      except perhaps to import instances from ‘Control.Applicative’
    To import instances alone, use: import Control.Applicative()
[ 7 of 24] Compiling Test.Framework.Utilities ( Test/Framework/Utilities.hs, dist/build/Test/Framework/Utilities.o )

Test/Framework/Utilities.hs:7:1: warning: [-Wunused-imports]
    The import of ‘Data.Monoid’ is redundant
      except perhaps to import instances from ‘Data.Monoid’
    To import instances alone, use: import Data.Monoid()
[ 8 of 24] Compiling Test.Framework.Runners.TestPattern ( Test/Framework/Runners/TestPattern.hs, dist/build/Test/Framework/Runners/TestPattern.o )
[ 9 of 24] Compiling Test.Framework.Runners.TimedConsumption ( Test/Framework/Runners/TimedConsumption.hs, dist/build/Test/Framework/Runners/TimedConsumption.o )
[10 of 24] Compiling Test.Framework.Runners.Console.Table ( Test/Framework/Runners/Console/Table.hs, dist/build/Test/Framework/Runners/Console/Table.o )
[11 of 24] Compiling Test.Framework.Seed ( Test/Framework/Seed.hs, dist/build/Test/Framework/Seed.o )
[12 of 24] Compiling Test.Framework.Options ( Test/Framework/Options.hs, dist/build/Test/Framework/Options.o )
[13 of 24] Compiling Test.Framework.Runners.Options ( Test/Framework/Runners/Options.hs, dist/build/Test/Framework/Runners/Options.o )
[14 of 24] Compiling Test.Framework.Core ( Test/Framework/Core.hs, dist/build/Test/Framework/Core.o )
[15 of 24] Compiling Test.Framework.Providers.API ( Test/Framework/Providers/API.hs, dist/build/Test/Framework/Providers/API.o )
[16 of 24] Compiling Test.Framework.Runners.Core ( Test/Framework/Runners/Core.hs, dist/build/Test/Framework/Runners/Core.o )

Test/Framework/Runners/Core.hs:19:1: warning: [-Wunused-imports]
    The import of ‘Data.Monoid’ is redundant
      except perhaps to import instances from ‘Data.Monoid’
    To import instances alone, use: import Data.Monoid()
[17 of 24] Compiling Test.Framework.Runners.API ( Test/Framework/Runners/API.hs, dist/build/Test/Framework/Runners/API.o )
[18 of 24] Compiling Test.Framework.Runners.Statistics ( Test/Framework/Runners/Statistics.hs, dist/build/Test/Framework/Runners/Statistics.o )

Test/Framework/Runners/Statistics.hs:13:1: warning: [-Wunused-imports]
    The import of ‘Data.Monoid’ is redundant
      except perhaps to import instances from ‘Data.Monoid’
    To import instances alone, use: import Data.Monoid()
[19 of 24] Compiling Test.Framework.Runners.Console.Statistics ( Test/Framework/Runners/Console/Statistics.hs, dist/build/Test/Framework/Runners/Console/Statistics.o )
[20 of 24] Compiling Test.Framework.Runners.Console.Run ( Test/Framework/Runners/Console/Run.hs, dist/build/Test/Framework/Runners/Console/Run.o )
[21 of 24] Compiling Test.Framework.Runners.XML.JUnitWriter ( Test/Framework/Runners/XML/JUnitWriter.hs, dist/build/Test/Framework/Runners/XML/JUnitWriter.o )
[22 of 24] Compiling Test.Framework.Runners.XML ( Test/Framework/Runners/XML.hs, dist/build/Test/Framework/Runners/XML.o )
[23 of 24] Compiling Test.Framework.Runners.Console ( Test/Framework/Runners/Console.hs, dist/build/Test/Framework/Runners/Console.o )

Test/Framework/Runners/Console.hs:26:1: warning: [-Wunused-imports]
    The import of ‘Data.Monoid’ is redundant
      except perhaps to import instances from ‘Data.Monoid’
    To import instances alone, use: import Data.Monoid()
[24 of 24] Compiling Test.Framework   ( Test/Framework.hs, dist/build/Test/Framework.o )
Running Haddock for test-framework-0.8.1.1...
Running hscolour for test-framework-0.8.1.1...
Preprocessing library test-framework-0.8.1.1...
Preprocessing library test-framework-0.8.1.1...

Test/Framework/Improving.hs:9:1: warning: [-Wunused-imports]
    The import of ‘Control.Applicative’ is redundant
      except perhaps to import instances from ‘Control.Applicative’
    To import instances alone, use: import Control.Applicative()

Test/Framework/Utilities.hs:7:1: warning: [-Wunused-imports]
    The import of ‘Data.Monoid’ is redundant
      except perhaps to import instances from ‘Data.Monoid’
    To import instances alone, use: import Data.Monoid()

Test/Framework/Runners/Core.hs:19:1: warning: [-Wunused-imports]
    The import of ‘Data.Monoid’ is redundant
      except perhaps to import instances from ‘Data.Monoid’
    To import instances alone, use: import Data.Monoid()

Test/Framework/Runners/Statistics.hs:13:1: warning: [-Wunused-imports]
    The import of ‘Data.Monoid’ is redundant
      except perhaps to import instances from ‘Data.Monoid’
    To import instances alone, use: import Data.Monoid()

Test/Framework/Runners/Console.hs:26:1: warning: [-Wunused-imports]
    The import of ‘Data.Monoid’ is redundant
      except perhaps to import instances from ‘Data.Monoid’
    To import instances alone, use: import Data.Monoid()
Haddock coverage:
  50% (  1 /  2) in 'Test.Framework.Runners.ThreadPool'
  Missing documentation for:
    Module header
   0% (  0 /  2) in 'Test.Framework.Runners.Console.Utilities'
  Missing documentation for:
    Module header
    hideCursorDuring (Test/Framework/Runners/Console/Utilities.hs:11)
   0% (  0 /  3) in 'Test.Framework.Runners.Console.ProgressBar'
  Missing documentation for:
    Module header
    Progress (Test/Framework/Runners/Console/ProgressBar.hs:8)
    progressBar (Test/Framework/Runners/Console/ProgressBar.hs:10)
   0% (  0 /  4) in 'Test.Framework.Runners.Console.Colors'
  Missing documentation for:
    Module header
    colorFail (Test/Framework/Runners/Console/Colors.hs:6)
    colorPass (Test/Framework/Runners/Console/Colors.hs:6)
    colorPassOrFail (Test/Framework/Runners/Console/Colors.hs:10)
   0% (  0 /  2) in 'Test.Framework.Runners.Processors'
  Missing documentation for:
    Module header
    processorCount (Test/Framework/Runners/Processors.hs:9)
  17% (  2 / 12) in 'Test.Framework.Improving'
  Missing documentation for:
    Module header
    :~> (Test/Framework/Improving.hs:14)
    bimapImproving (Test/Framework/Improving.hs:21)
    improvingLast (Test/Framework/Improving.hs:25)
    consumeImproving (Test/Framework/Improving.hs:29)
    ImprovingIO (Test/Framework/Improving.hs:34)
    yieldImprovement (Test/Framework/Improving.hs:49)
    runImprovingIO (Test/Framework/Improving.hs:61)
    tunnelImprovingIO (Test/Framework/Improving.hs:58)
    liftIO (Test/Framework/Improving.hs:75)
   8% (  1 / 13) in 'Test.Framework.Utilities'
  Missing documentation for:
    Module header
    K (Test/Framework/Utilities.hs:11)
    secondsToMicroseconds (Test/Framework/Utilities.hs:14)
    microsecondsToPicoseconds (Test/Framework/Utilities.hs:17)
    listToMaybeLast (Test/Framework/Utilities.hs:20)
    mappendBy (Test/Framework/Utilities.hs:23)
    orElse (Test/Framework/Utilities.hs:26)
    onLeft (Test/Framework/Utilities.hs:29)
    onRight (Test/Framework/Utilities.hs:32)
    mapAccumLM (Test/Framework/Utilities.hs:51)
    padRight (Test/Framework/Utilities.hs:58)
    dropLast (Test/Framework/Utilities.hs:61)
   0% (  0 /  4) in 'Test.Framework.Runners.TestPattern'
  Missing documentation for:
    Module header
    TestPattern (Test/Framework/Runners/TestPattern.hs:30)
    parseTestPattern (Test/Framework/Runners/TestPattern.hs:40)
    testPatternMatches (Test/Framework/Runners/TestPattern.hs:60)
  50% (  1 /  2) in 'Test.Framework.Runners.TimedConsumption'
  Missing documentation for:
    Module header
   0% (  0 /  4) in 'Test.Framework.Runners.Console.Table'
  Missing documentation for:
    Module header
    Cell (Test/Framework/Runners/Console/Table.hs:15)
    Column (Test/Framework/Runners/Console/Table.hs:18)
    renderTable (Test/Framework/Runners/Console/Table.hs:23)
  17% (  1 /  6) in 'Test.Framework.Seed'
  Missing documentation for:
    Module header
    Seed (Test/Framework/Seed.hs:10)
     (Test/Framework/Seed.hs:13)
     (Test/Framework/Seed.hs:17)
    newStdGenWithKnownSeed (Test/Framework/Seed.hs:29)
   0% (  0 /  5) in 'Test.Framework.Options'
  Missing documentation for:
    Module header
    TestOptions (Test/Framework/Options.hs:9)
    CompleteTestOptions (Test/Framework/Options.hs:10)
    TestOptions' (Test/Framework/Options.hs:11)
     (Test/Framework/Options.hs:26)
   0% (  0 /  7) in 'Test.Framework.Runners.Options'
  Missing documentation for:
    Module header
    ColorMode (Test/Framework/Runners/Options.hs:12)
    RunnerOptions (Test/Framework/Runners/Options.hs:14)
    CompleteRunnerOptions (Test/Framework/Runners/Options.hs:15)
    RunnerOptions' (Test/Framework/Runners/Options.hs:16)
     (Test/Framework/Runners/Options.hs:27)
    TestPattern (Test/Framework/Runners/TestPattern.hs:30)
  77% ( 10 / 13) in 'Test.Framework.Core'
  Missing documentation for:
    Module header
    MutuallyExcluded (Test/Framework/Core.hs:63)
     (Test/Framework/Core.hs:67)
  42% ( 16 / 38) in 'Test.Framework.Providers.API'
  Missing documentation for:
    MutuallyExcluded (Test/Framework/Core.hs:63)
     (Test/Framework/Core.hs:67)
    :~> (Test/Framework/Improving.hs:14)
    bimapImproving (Test/Framework/Improving.hs:21)
    improvingLast (Test/Framework/Improving.hs:25)
    consumeImproving (Test/Framework/Improving.hs:29)
    ImprovingIO (Test/Framework/Improving.hs:34)
    yieldImprovement (Test/Framework/Improving.hs:49)
    runImprovingIO (Test/Framework/Improving.hs:61)
    tunnelImprovingIO (Test/Framework/Improving.hs:58)
    liftIO (Test/Framework/Improving.hs:75)
    K (Test/Framework/Utilities.hs:11)
    secondsToMicroseconds (Test/Framework/Utilities.hs:14)
    microsecondsToPicoseconds (Test/Framework/Utilities.hs:17)
    listToMaybeLast (Test/Framework/Utilities.hs:20)
    mappendBy (Test/Framework/Utilities.hs:23)
    orElse (Test/Framework/Utilities.hs:26)
    onLeft (Test/Framework/Utilities.hs:29)
    onRight (Test/Framework/Utilities.hs:32)
    mapAccumLM (Test/Framework/Utilities.hs:51)
    padRight (Test/Framework/Utilities.hs:58)
    dropLast (Test/Framework/Utilities.hs:61)
  38% (  3 /  8) in 'Test.Framework.Runners.Core'
  Missing documentation for:
    Module header
    RunningTest (Test/Framework/Runners/Core.hs:29)
    SomeImproving (Test/Framework/Runners/Core.hs:28)
    FinishedTest (Test/Framework/Runners/Core.hs:31)
    runTests (Test/Framework/Runners/Core.hs:33)
 100% (  4 /  4) in 'Test.Framework.Runners.API'
  31% (  4 / 13) in 'Test.Framework.Runners.Statistics'
  Missing documentation for:
    Module header
    testCountTestTypes (Test/Framework/Runners/Statistics.hs:19)
    testCountForType (Test/Framework/Runners/Statistics.hs:22)
    adjustTestCount (Test/Framework/Runners/Statistics.hs:25)
    ts_pending_tests (Test/Framework/Runners/Statistics.hs:55)
    ts_no_failures (Test/Framework/Runners/Statistics.hs:58)
    updateTestStatistics (Test/Framework/Runners/Statistics.hs:71)
    totalRunTestsList (Test/Framework/Runners/Statistics.hs:83)
    gatherStatistics (Test/Framework/Runners/Statistics.hs:86)
  50% (  1 /  2) in 'Test.Framework.Runners.Console.Statistics'
  Missing documentation for:
    Module header
   0% (  0 /  2) in 'Test.Framework.Runners.Console.Run'
  Missing documentation for:
    Module header
    showRunTestsTop (Test/Framework/Runners/Console/Run.hs:27)
  67% (  2 /  3) in 'Test.Framework.Runners.XML.JUnitWriter'
  Missing documentation for:
    Module header
   0% (  0 /  2) in 'Test.Framework.Runners.XML'
  Missing documentation for:
    Module header
    produceReport (Test/Framework/Runners/XML.hs:21)
  75% (  6 /  8) in 'Test.Framework.Runners.Console'
  Missing documentation for:
    Module header
    defaultMain (Test/Framework/Runners/Console.hs:122)
  88% ( 15 / 17) in 'Test.Framework'
  Missing documentation for:
    MutuallyExcluded (Test/Framework/Core.hs:63)
     (Test/Framework/Core.hs:67)
Documentation created: dist/doc/html/test-framework/index.html,
dist/doc/html/test-framework/test-framework.txt
Creating package registration file:
/tmp/pkgConf-test-framework-0.8.18024387992004077773.1
Installing library in
/home/builder/hackage-server/build-cache/tmp-install/lib/x86_64-linux-ghc-8.0.1.20160701/test-framework-0.8.1.1-DFP52NL4lkqFplCBGMK9EV
Registering test-framework-0.8.1.1...
cabal: Leaving directory '/tmp/cabal-tmp-10191/test-framework-0.8.1.1'
Installed test-framework-0.8.1.1
cabal: Entering directory '/tmp/cabal-tmp-10191/attoparsec-0.13.1.0'
Configuring attoparsec-0.13.1.0...
Building attoparsec-0.13.1.0...
Preprocessing library attoparsec-0.13.1.0...
[ 1 of 21] Compiling Data.Attoparsec.Text.FastSet ( Data/Attoparsec/Text/FastSet.hs, dist/build/Data/Attoparsec/Text/FastSet.o )
[ 2 of 21] Compiling Data.Attoparsec.Internal.Fhthagn ( Data/Attoparsec/Internal/Fhthagn.hs, dist/build/Data/Attoparsec/Internal/Fhthagn.o )
[ 3 of 21] Compiling Data.Attoparsec.Text.Buffer ( Data/Attoparsec/Text/Buffer.hs, dist/build/Data/Attoparsec/Text/Buffer.o )
[ 4 of 21] Compiling Data.Attoparsec.ByteString.Buffer ( Data/Attoparsec/ByteString/Buffer.hs, dist/build/Data/Attoparsec/ByteString/Buffer.o )
[ 5 of 21] Compiling Data.Attoparsec.Zepto ( Data/Attoparsec/Zepto.hs, dist/build/Data/Attoparsec/Zepto.o )
[ 6 of 21] Compiling Data.Attoparsec.Number ( Data/Attoparsec/Number.hs, dist/build/Data/Attoparsec/Number.o )
[ 7 of 21] Compiling Data.Attoparsec.ByteString.FastSet ( Data/Attoparsec/ByteString/FastSet.hs, dist/build/Data/Attoparsec/ByteString/FastSet.o )
[ 8 of 21] Compiling Data.Attoparsec.Internal.Types ( Data/Attoparsec/Internal/Types.hs, dist/build/Data/Attoparsec/Internal/Types.o )
[ 9 of 21] Compiling Data.Attoparsec.Types ( Data/Attoparsec/Types.hs, dist/build/Data/Attoparsec/Types.o )
[10 of 21] Compiling Data.Attoparsec.Internal ( Data/Attoparsec/Internal.hs, dist/build/Data/Attoparsec/Internal.o )
[11 of 21] Compiling Data.Attoparsec.Combinator ( Data/Attoparsec/Combinator.hs, dist/build/Data/Attoparsec/Combinator.o )
[12 of 21] Compiling Data.Attoparsec.ByteString.Internal ( Data/Attoparsec/ByteString/Internal.hs, dist/build/Data/Attoparsec/ByteString/Internal.o )
[13 of 21] Compiling Data.Attoparsec.Text.Internal ( Data/Attoparsec/Text/Internal.hs, dist/build/Data/Attoparsec/Text/Internal.o )
[14 of 21] Compiling Data.Attoparsec.Text ( Data/Attoparsec/Text.hs, dist/build/Data/Attoparsec/Text.o )
[15 of 21] Compiling Data.Attoparsec.Text.Lazy ( Data/Attoparsec/Text/Lazy.hs, dist/build/Data/Attoparsec/Text/Lazy.o )
[16 of 21] Compiling Data.Attoparsec.ByteString ( Data/Attoparsec/ByteString.hs, dist/build/Data/Attoparsec/ByteString.o )
[17 of 21] Compiling Data.Attoparsec.ByteString.Char8 ( Data/Attoparsec/ByteString/Char8.hs, dist/build/Data/Attoparsec/ByteString/Char8.o )
[18 of 21] Compiling Data.Attoparsec.Char8 ( Data/Attoparsec/Char8.hs, dist/build/Data/Attoparsec/Char8.o )
[19 of 21] Compiling Data.Attoparsec.ByteString.Lazy ( Data/Attoparsec/ByteString/Lazy.hs, dist/build/Data/Attoparsec/ByteString/Lazy.o )
[20 of 21] Compiling Data.Attoparsec.Lazy ( Data/Attoparsec/Lazy.hs, dist/build/Data/Attoparsec/Lazy.o )
[21 of 21] Compiling Data.Attoparsec  ( Data/Attoparsec.hs, dist/build/Data/Attoparsec.o )
Running Haddock for attoparsec-0.13.1.0...
Running hscolour for attoparsec-0.13.1.0...
Preprocessing library attoparsec-0.13.1.0...
Preprocessing library attoparsec-0.13.1.0...
Haddock coverage:
  60% (  6 / 10) in 'Data.Attoparsec.Text.FastSet'
  Missing documentation for:
    FastSet (Data/Attoparsec/Text/FastSet.hs:40)
    fromList (Data/Attoparsec/Text/FastSet.hs:82)
    set (Data/Attoparsec/Text/FastSet.hs:104)
    charClass (Data/Attoparsec/Text/FastSet.hs:117)
  50% (  1 /  2) in 'Data.Attoparsec.Internal.Fhthagn'
  Missing documentation for:
    Module header
  36% (  4 / 11) in 'Data.Attoparsec.Text.Buffer'
  Missing documentation for:
    Buffer (Data/Attoparsec/Text/Buffer.hs:57)
    unbuffer (Data/Attoparsec/Text/Buffer.hs:74)
    unbufferAt (Data/Attoparsec/Text/Buffer.hs:77)
    length (Data/Attoparsec/Text/Buffer.hs:124)
    pappend (Data/Attoparsec/Text/Buffer.hs:97)
    substring (Data/Attoparsec/Text/Buffer.hs:128)
    dropWord16 (Data/Attoparsec/Text/Buffer.hs:135)
  22% (  2 /  9) in 'Data.Attoparsec.ByteString.Buffer'
  Missing documentation for:
    Buffer (Data/Attoparsec/ByteString/Buffer.hs:70)
    unbuffer (Data/Attoparsec/ByteString/Buffer.hs:87)
    pappend (Data/Attoparsec/ByteString/Buffer.hs:103)
    length (Data/Attoparsec/ByteString/Buffer.hs:136)
    unsafeIndex (Data/Attoparsec/ByteString/Buffer.hs:140)
    substring (Data/Attoparsec/ByteString/Buffer.hs:145)
    unsafeDrop (Data/Attoparsec/ByteString/Buffer.hs:152)
  89% (  8 /  9) in 'Data.Attoparsec.Zepto'
  Missing documentation for:
    Parser (Data/Attoparsec/Zepto.hs:68)
 100% (  2 /  2) in 'Data.Attoparsec.Number'
  69% (  9 / 13) in 'Data.Attoparsec.ByteString.FastSet'
  Missing documentation for:
    FastSet (Data/Attoparsec/ByteString/FastSet.hs:44)
    fromList (Data/Attoparsec/ByteString/FastSet.hs:62)
    fromSet (Data/Attoparsec/ByteString/FastSet.hs:44)
    charClass (Data/Attoparsec/ByteString/FastSet.hs:111)
  60% (  6 / 10) in 'Data.Attoparsec.Internal.Types'
  Missing documentation for:
    State (Data/Attoparsec/Internal/Types.hs:118)
    Failure (Data/Attoparsec/Internal/Types.hs:122)
    Success (Data/Attoparsec/Internal/Types.hs:124)
    Pos (Data/Attoparsec/Internal/Types.hs:46)
 100% (  4 /  4) in 'Data.Attoparsec.Types'
 100% ( 10 / 10) in 'Data.Attoparsec.Internal'
 100% ( 24 / 24) in 'Data.Attoparsec.Combinator'
  93% ( 39 / 42) in 'Data.Attoparsec.ByteString.Internal'
  Missing documentation for:
    Parser (Data/Attoparsec/ByteString/Internal.hs:95)
    Result (Data/Attoparsec/ByteString/Internal.hs:96)
    storable (Data/Attoparsec/ByteString/Internal.hs:138)
  95% ( 39 / 41) in 'Data.Attoparsec.Text.Internal'
  Missing documentation for:
    Parser (Data/Attoparsec/Text/Internal.hs:89)
    Result (Data/Attoparsec/Text/Internal.hs:90)
  98% ( 90 / 92) in 'Data.Attoparsec.Text'
  Missing documentation for:
    Parser (Data/Attoparsec/Text/Internal.hs:89)
    Result (Data/Attoparsec/Text/Internal.hs:90)
 100% (  9 /  9) in 'Data.Attoparsec.Text.Lazy'
  97% ( 66 / 68) in 'Data.Attoparsec.ByteString'
  Missing documentation for:
    Parser (Data/Attoparsec/ByteString/Internal.hs:95)
    Result (Data/Attoparsec/ByteString/Internal.hs:96)
  98% ( 91 / 93) in 'Data.Attoparsec.ByteString.Char8'
  Missing documentation for:
    Parser (Data/Attoparsec/ByteString/Internal.hs:95)
    Result (Data/Attoparsec/ByteString/Internal.hs:96)
 100% (  2 /  2) in 'Data.Attoparsec.Char8'
 100% (  9 /  9) in 'Data.Attoparsec.ByteString.Lazy'
 100% (  2 /  2) in 'Data.Attoparsec.Lazy'
 100% (  2 /  2) in 'Data.Attoparsec'
Warning: Data.Attoparsec.ByteString.Char8: could not find link destinations for:
    ~
Documentation created: dist/doc/html/attoparsec/index.html,
dist/doc/html/attoparsec/attoparsec.txt
Creating package registration file:
/tmp/pkgConf-attoparsec-0.13.12065353127516443731.0
Installing library in
/home/builder/hackage-server/build-cache/tmp-install/lib/x86_64-linux-ghc-8.0.1.20160701/attoparsec-0.13.1.0-K5Fyc3MOMYs22DiprZQxLM
Registering attoparsec-0.13.1.0...
cabal: Leaving directory '/tmp/cabal-tmp-10191/attoparsec-0.13.1.0'
Installed attoparsec-0.13.1.0
cabal: Entering directory '/tmp/cabal-tmp-10191/HTTP-4000.3.3'
Configuring HTTP-4000.3.3...
Building HTTP-4000.3.3...
Preprocessing library HTTP-4000.3.3...
[ 1 of 18] Compiling Network.HTTP.MD5Aux ( Network/HTTP/MD5Aux.hs, dist/build/Network/HTTP/MD5Aux.o )
[ 2 of 18] Compiling Paths_HTTP       ( dist/build/autogen/Paths_HTTP.hs, dist/build/Paths_HTTP.o )
[ 3 of 18] Compiling Network.HTTP.Base64 ( Network/HTTP/Base64.hs, dist/build/Network/HTTP/Base64.o )
[ 4 of 18] Compiling Network.Stream   ( Network/Stream.hs, dist/build/Network/Stream.o )

Network/Stream.hs:35:1: warning: [-Wdeprecations]
    Module ‘Control.Monad.Error’ is deprecated:
      Use Control.Monad.Except instead

Network/Stream.hs:44:10: warning: [-Wdeprecations]
    In the use of type constructor or class ‘Error’
    (imported from Control.Monad.Error, but defined in transformers-0.5.2.0:Control.Monad.Trans.Error):
    Deprecated: "Use Control.Monad.Trans.Except instead"

Network/Stream.hs:44:10: warning: [-Wdeprecations]
    In the use of type constructor or class ‘Error’
    (imported from Control.Monad.Error, but defined in transformers-0.5.2.0:Control.Monad.Trans.Error):
    Deprecated: "Use Control.Monad.Trans.Except instead"

Network/Stream.hs:45:11: warning: [-Wdeprecations]
    In the use of ‘strMsg’
    (imported from Control.Monad.Error, but defined in transformers-0.5.2.0:Control.Monad.Trans.Error):
    Deprecated: "Use Control.Monad.Trans.Except instead"

Network/Stream.hs:52:24: warning: [-Wdeprecations]
    In the use of ‘strMsg’
    (imported from Control.Monad.Error, but defined in transformers-0.5.2.0:Control.Monad.Trans.Error):
    Deprecated: "Use Control.Monad.Trans.Except instead"
[ 5 of 18] Compiling Network.HTTP.Utils ( Network/HTTP/Utils.hs, dist/build/Network/HTTP/Utils.o )
[ 6 of 18] Compiling Network.HTTP.Headers ( Network/HTTP/Headers.hs, dist/build/Network/HTTP/Headers.o )
[ 7 of 18] Compiling Network.HTTP.Cookie ( Network/HTTP/Cookie.hs, dist/build/Network/HTTP/Cookie.o )
[ 8 of 18] Compiling Network.BufferType ( Network/BufferType.hs, dist/build/Network/BufferType.o )
[ 9 of 18] Compiling Network.HTTP.Base ( Network/HTTP/Base.hs, dist/build/Network/HTTP/Base.o )

Network/HTTP/Base.hs:110:1: warning: [-Wdeprecations]
    Module ‘Control.Monad.Error’ is deprecated:
      Use Control.Monad.Except instead
[10 of 18] Compiling Network.TCP      ( Network/TCP.hs, dist/build/Network/TCP.o )

Network/TCP.hs:118:10: warning: [-Wredundant-constraints]
    • Redundant constraint: Eq ty
    • In the instance declaration for ‘Eq (StreamHooks ty)’

Network/TCP.hs:245:32: warning: [-Wdeprecations]
    In the use of ‘sClose’ (imported from Network.Socket):
    Deprecated: "use 'close'"

Network/TCP.hs:278:1: warning: [-Wredundant-constraints]
    • Redundant constraint: HStream a
    • In the type signature for:
           closeConnection :: HStream a => HandleStream a -> IO Bool -> IO ()

Network/TCP.hs:298:5: warning: [-Wdeprecations]
    In the use of ‘sClose’ (imported from Network.Socket):
    Deprecated: "use 'close'"
[11 of 18] Compiling Network.StreamDebugger ( Network/StreamDebugger.hs, dist/build/Network/StreamDebugger.o )

Network/StreamDebugger.hs:65:1: warning: [-Wredundant-constraints]
    • Redundant constraint: Stream a
    • In the type signature for:
           debugStream :: Stream a => FilePath -> a -> IO (StreamDebugger a)

Network/StreamDebugger.hs:84:1: warning: [-Wredundant-constraints]
    • Redundant constraint: HStream ty
    • In the type signature for:
           debugStreamHooks :: HStream ty =>
                               Handle -> String -> StreamHooks ty
[12 of 18] Compiling Network.StreamSocket ( Network/StreamSocket.hs, dist/build/Network/StreamSocket.o )

Network/StreamSocket.hs:53:21: warning: [-Wdeprecations]
    In the use of ‘recv’ (imported from Network.Socket):
    "Use recv defined in "Network.Socket.ByteString""

Network/StreamSocket.hs:62:10: warning: [-Wdeprecations]
    In the use of ‘sClose’ (imported from Network.Socket):
    Deprecated: "use 'close'"

Network/StreamSocket.hs:92:12: warning: [-Wdeprecations]
    In the use of ‘send’ (imported from Network.Socket):
    "Use send defined in "Network.Socket.ByteString""
[13 of 18] Compiling Network.HTTP.Auth ( Network/HTTP/Auth.hs, dist/build/Network/HTTP/Auth.o )
[14 of 18] Compiling Network.HTTP.Proxy ( Network/HTTP/Proxy.hs, dist/build/Network/HTTP/Proxy.o )
[15 of 18] Compiling Network.HTTP.HandleStream ( Network/HTTP/HandleStream.hs, dist/build/Network/HTTP/HandleStream.o )
[16 of 18] Compiling Network.HTTP     ( Network/HTTP.hs, dist/build/Network/HTTP.o )
[17 of 18] Compiling Network.HTTP.Stream ( Network/HTTP/Stream.hs, dist/build/Network/HTTP/Stream.o )
[18 of 18] Compiling Network.Browser  ( Network/Browser.hs, dist/build/Network/Browser.o )
Running Haddock for HTTP-4000.3.3...
Running hscolour for HTTP-4000.3.3...
Preprocessing library HTTP-4000.3.3...
Preprocessing library HTTP-4000.3.3...

Network/Stream.hs:35:1: warning: [-Wdeprecations]
    Module ‘Control.Monad.Error’ is deprecated:
      Use Control.Monad.Except instead

Network/Stream.hs:44:10: warning: [-Wdeprecations]
    In the use of type constructor or class ‘Error’
    (imported from Control.Monad.Error, but defined in transformers-0.5.2.0:Control.Monad.Trans.Error):
    Deprecated: "Use Control.Monad.Trans.Except instead"

Network/Stream.hs:44:10: warning: [-Wdeprecations]
    In the use of type constructor or class ‘Error’
    (imported from Control.Monad.Error, but defined in transformers-0.5.2.0:Control.Monad.Trans.Error):
    Deprecated: "Use Control.Monad.Trans.Except instead"

Network/Stream.hs:45:11: warning: [-Wdeprecations]
    In the use of ‘strMsg’
    (imported from Control.Monad.Error, but defined in transformers-0.5.2.0:Control.Monad.Trans.Error):
    Deprecated: "Use Control.Monad.Trans.Except instead"

Network/Stream.hs:52:24: warning: [-Wdeprecations]
    In the use of ‘strMsg’
    (imported from Control.Monad.Error, but defined in transformers-0.5.2.0:Control.Monad.Trans.Error):
    Deprecated: "Use Control.Monad.Trans.Except instead"

Network/HTTP/Base.hs:110:1: warning: [-Wdeprecations]
    Module ‘Control.Monad.Error’ is deprecated:
      Use Control.Monad.Except instead

Network/TCP.hs:118:10: warning: [-Wredundant-constraints]
    • Redundant constraint: Eq ty
    • In the instance declaration for ‘Eq (StreamHooks ty)’

Network/TCP.hs:245:32: warning: [-Wdeprecations]
    In the use of ‘sClose’ (imported from Network.Socket):
    Deprecated: "use 'close'"

Network/TCP.hs:278:1: warning: [-Wredundant-constraints]
    • Redundant constraint: HStream a
    • In the type signature for:
           closeConnection :: HStream a => HandleStream a -> IO Bool -> IO ()

Network/TCP.hs:298:5: warning: [-Wdeprecations]
    In the use of ‘sClose’ (imported from Network.Socket):
    Deprecated: "use 'close'"

Network/StreamDebugger.hs:65:1: warning: [-Wredundant-constraints]
    • Redundant constraint: Stream a
    • In the type signature for:
           debugStream :: Stream a => FilePath -> a -> IO (StreamDebugger a)

Network/StreamDebugger.hs:84:1: warning: [-Wredundant-constraints]
    • Redundant constraint: HStream ty
    • In the type signature for:
           debugStreamHooks :: HStream ty =>
                               Handle -> String -> StreamHooks ty

Network/StreamSocket.hs:53:21: warning: [-Wdeprecations]
    In the use of ‘recv’ (imported from Network.Socket):
    "Use recv defined in "Network.Socket.ByteString""

Network/StreamSocket.hs:62:10: warning: [-Wdeprecations]
    In the use of ‘sClose’ (imported from Network.Socket):
    Deprecated: "use 'close'"

Network/StreamSocket.hs:92:12: warning: [-Wdeprecations]
    In the use of ‘send’ (imported from Network.Socket):
    "Use send defined in "Network.Socket.ByteString""
Haddock coverage:
   0% (  0 / 10) in 'Network.HTTP.MD5Aux'
  Missing documentation for:
    Module header
    md5 (Network/HTTP/MD5Aux.hs:105)
    md5s (Network/HTTP/MD5Aux.hs:111)
    md5i (Network/HTTP/MD5Aux.hs:117)
    MD5 (Network/HTTP/MD5Aux.hs:27)
    ABCD (Network/HTTP/MD5Aux.hs:20)
    Zord64 (Network/HTTP/MD5Aux.hs:13)
    Str (Network/HTTP/MD5Aux.hs:21)
    BoolList (Network/HTTP/MD5Aux.hs:22)
    WordList (Network/HTTP/MD5Aux.hs:23)
   0% (  0 /  8) in 'Paths_HTTP'
  Missing documentation for:
    Module header
    version (dist/build/autogen/Paths_HTTP.hs:28)
    getBinDir (dist/build/autogen/Paths_HTTP.hs:38)
    getLibDir (dist/build/autogen/Paths_HTTP.hs:38)
    getDataDir (dist/build/autogen/Paths_HTTP.hs:38)
    getLibexecDir (dist/build/autogen/Paths_HTTP.hs:38)
    getDataFileName (dist/build/autogen/Paths_HTTP.hs:45)
    getSysconfDir (dist/build/autogen/Paths_HTTP.hs:38)
  40% (  2 /  5) in 'Network.HTTP.Base64'
  Missing documentation for:
    encode (Network/HTTP/Base64.hs:269)
    decode (Network/HTTP/Base64.hs:281)
    Octet (Network/HTTP/Base64.hs:161)
  33% (  3 /  9) in 'Network.Stream'
  Missing documentation for:
    ConnError (Network/Stream.hs:37)
    bindE (Network/Stream.hs:60)
    fmapE (Network/Stream.hs:64)
    failParse (Network/Stream.hs:54)
    failWith (Network/Stream.hs:57)
    failMisc (Network/Stream.hs:51)
 100% ( 12 / 12) in 'Network.HTTP.Utils'
  83% ( 15 / 18) in 'Network.HTTP.Headers'
  Missing documentation for:
    hdrName (Network/HTTP/Headers.hs:51)
    hdrValue (Network/HTTP/Headers.hs:54)
    HeaderSetter (Network/HTTP/Headers.hs:209)
 100% (  5 /  5) in 'Network.HTTP.Cookie'
 100% (  6 /  6) in 'Network.BufferType'
  53% ( 31 / 59) in 'Network.HTTP.Base'
  Missing documentation for:
    httpVersion (Network/HTTP/Base.hs:243)
    Request_String (Network/HTTP/Base.hs:280)
    Response_String (Network/HTTP/Base.hs:281)
    HTTPRequest (Network/HTTP/Base.hs:286)
    HTTPResponse (Network/HTTP/Base.hs:287)
    urlEncode (Network/HTTP/Base.hs:681)
    urlDecode (Network/HTTP/Base.hs:671)
    urlEncodeVars (Network/HTTP/Base.hs:705)
    URIAuthority (Network/HTTP/Base.hs:138)
    uriToAuthorityString (Network/HTTP/Base.hs:185)
    uriAuthToString (Network/HTTP/Base.hs:188)
    uriAuthPort (Network/HTTP/Base.hs:195)
    reqURIAuth (Network/HTTP/Base.hs:220)
    parseResponseHead (Network/HTTP/Base.hs:462)
    parseRequestHead (Network/HTTP/Base.hs:439)
    ResponseNextStep (Network/HTTP/Base.hs:552)
    matchResponse (Network/HTTP/Base.hs:559)
    defaultNormalizeRequestOptions (Network/HTTP/Base.hs:749)
    splitRequestURI (Network/HTTP/Base.hs:863)
    normalizeRequestURI (Network/HTTP/Base.hs:727)
    normalizeHostHeader (Network/HTTP/Base.hs:868)
    findConnClose (Network/HTTP/Base.hs:876)
    defaultGETRequest (Network/HTTP/Base.hs:383)
    defaultGETRequest_ (Network/HTTP/Base.hs:386)
    setRequestBody (Network/HTTP/Base.hs:409)
    catchIO_ (Network/HTTP/Base.hs:990)
    responseParseError (Network/HTTP/Base.hs:993)
    failHTTPS (Network/HTTP/Base.hs:212)
  40% (  6 / 15) in 'Network.TCP'
  Missing documentation for:
    EndPoint (Network/TCP.hs:83)
    openTCPConnection (Network/TCP.hs:213)
    isTCPConnectedTo (Network/TCP.hs:311)
    HandleStream (Network/TCP.hs:81)
    StreamHooks (Network/TCP.hs:109)
    nullHooks (Network/TCP.hs:121)
    setStreamHooks (Network/TCP.hs:130)
    getStreamHooks (Network/TCP.hs:133)
    hstreamToConnection (Network/TCP.hs:101)
  75% (  3 /  4) in 'Network.StreamDebugger'
  Missing documentation for:
    debugByteStream (Network/StreamDebugger.hs:71)
  67% (  2 /  3) in 'Network.StreamSocket'
  Missing documentation for:
    myrecv (Network/StreamSocket.hs:50)
  71% (  5 /  7) in 'Network.HTTP.Auth'
  Missing documentation for:
    Challenge (Network/HTTP/Auth.hs:58)
    Qop (Network/HTTP/Auth.hs:78)
  80% (  4 /  5) in 'Network.HTTP.Proxy'
  Missing documentation for:
    noProxy (Network/HTTP/Proxy.hs:65)
 100% (  8 /  8) in 'Network.HTTP.HandleStream'
 100% ( 16 / 16) in 'Network.HTTP'
  75% (  6 /  8) in 'Network.HTTP.Stream'
  Missing documentation for:
    sendHTTP (Network/HTTP/Stream.hs:84)
    sendHTTP_notify (Network/HTTP/Stream.hs:87)
  78% ( 46 / 59) in 'Network.Browser'
  Missing documentation for:
    setAuthorities (Network/Browser.hs:282)
    addAuthority (Network/Browser.hs:287)
    Challenge (Network/HTTP/Auth.hs:58)
    Qop (Network/HTTP/Auth.hs:78)
    getAllowBasicAuth (Network/Browser.hs:302)
    RequestID (Network/Browser.hs:625)
    out (Network/Browser.hs:504)
    err (Network/Browser.hs:504)
    defaultGETRequest (Network/HTTP/Base.hs:383)
    defaultGETRequest_ (Network/HTTP/Base.hs:386)
    formToRequest (Network/Browser.hs:1074)
    Form (Network/Browser.hs:1072)
    FormVar (Network/Browser.hs:1070)
Documentation created: dist/doc/html/HTTP/index.html,
dist/doc/html/HTTP/HTTP.txt
Creating package registration file:
/tmp/pkgConf-HTTP-4000.38431809211145999278.3
Installing library in
/home/builder/hackage-server/build-cache/tmp-install/lib/x86_64-linux-ghc-8.0.1.20160701/HTTP-4000.3.3-81IZjVTtNYopeIhp3XE7m
Registering HTTP-4000.3.3...
cabal: Leaving directory '/tmp/cabal-tmp-10191/HTTP-4000.3.3'
Installed HTTP-4000.3.3
cabal: Entering directory '/tmp/cabal-tmp-10191/test-framework-hunit-0.3.0.2'
Configuring test-framework-hunit-0.3.0.2...
Building test-framework-hunit-0.3.0.2...
Preprocessing library test-framework-hunit-0.3.0.2...
[1 of 1] Compiling Test.Framework.Providers.HUnit ( Test/Framework/Providers/HUnit.hs, dist/build/Test/Framework/Providers/HUnit.o )
Running Haddock for test-framework-hunit-0.3.0.2...
Running hscolour for test-framework-hunit-0.3.0.2...
Preprocessing library test-framework-hunit-0.3.0.2...
Preprocessing library test-framework-hunit-0.3.0.2...
Haddock coverage:
 100% (  3 /  3) in 'Test.Framework.Providers.HUnit'
Documentation created: dist/doc/html/test-framework-hunit/index.html,
dist/doc/html/test-framework-hunit/test-framework-hunit.txt
Creating package registration file:
/tmp/pkgConf-test-framework-hunit-0.3.016197729321637336066.2
Installing library in
/home/builder/hackage-server/build-cache/tmp-install/lib/x86_64-linux-ghc-8.0.1.20160701/test-framework-hunit-0.3.0.2-7fjdeztK9PJ2d14XgWP0am
Registering test-framework-hunit-0.3.0.2...
cabal: Leaving directory '/tmp/cabal-tmp-10191/test-framework-hunit-0.3.0.2'
Installed test-framework-hunit-0.3.0.2
cabal: Entering directory '/tmp/cabal-tmp-10191/test-framework-quickcheck2-0.3.0.3'
Configuring test-framework-quickcheck2-0.3.0.3...
Building test-framework-quickcheck2-0.3.0.3...
Preprocessing library test-framework-quickcheck2-0.3.0.3...
[1 of 1] Compiling Test.Framework.Providers.QuickCheck2 ( Test/Framework/Providers/QuickCheck2.hs, dist/build/Test/Framework/Providers/QuickCheck2.o )

Test/Framework/Providers/QuickCheck2.hs:114:5: warning: [-Wincomplete-patterns]
    Pattern match(es) are non-exhaustive
    In an equation for ‘toPropertyStatus’:
        Patterns not matched: (InsufficientCoverage _ _ _)
Running Haddock for test-framework-quickcheck2-0.3.0.3...
Running hscolour for test-framework-quickcheck2-0.3.0.3...
Preprocessing library test-framework-quickcheck2-0.3.0.3...
Preprocessing library test-framework-quickcheck2-0.3.0.3...
Haddock coverage:
 100% (  2 /  2) in 'Test.Framework.Providers.QuickCheck2'
Documentation created: dist/doc/html/test-framework-quickcheck2/index.html,
dist/doc/html/test-framework-quickcheck2/test-framework-quickcheck2.txt
Creating package registration file:
/tmp/pkgConf-test-framework-quickcheck2-0.3.01539963760224090859.3
Installing library in
/home/builder/hackage-server/build-cache/tmp-install/lib/x86_64-linux-ghc-8.0.1.20160701/test-framework-quickcheck2-0.3.0.3-2wij8dDrpVo6gzZ8hXLnSm
Registering test-framework-quickcheck2-0.3.0.3...
cabal: Leaving directory '/tmp/cabal-tmp-10191/test-framework-quickcheck2-0.3.0.3'
Installed test-framework-quickcheck2-0.3.0.3
cabal: Error: some packages failed to install:
Combinatorrent-0.3.2 depends on network-bytestring-0.1.1.2 which failed to
install.
network-bytestring-0.1.1.2 failed during the building phase. The exception
was:
ExitFailure 1