Build #1 for fltkhs-themes-0.1.0.1

[all reports]

Package fltkhs-themes-0.1.0.1
Install DependencyFailed fltkhs-themes-0.1.0.1
Docs NotTried
Tests NotTried
Time submitted 2018-10-27 15:08:03.99767073 UTC
Compiler ghc-8.4.3
OS linux
Arch x86_64
Dependencies base-4.11.1.0, bytestring-0.10.8.2, fltkhs-0.6.0.0, load-font-0.1.0.2, text-1.2.3.0, vector-0.12.0.1
Flags none

Build log

[view raw]

Resolving dependencies...
Configuring load-font-0.1.0.2...
Configuring primitive-0.6.4.0...
Building primitive-0.6.4.0...
Building load-font-0.1.0.2...
Installed load-font-0.1.0.2
Installed primitive-0.6.4.0
Configuring vector-0.12.0.1...
Building vector-0.12.0.1...
Installed vector-0.12.0.1
Configuring fltkhs-0.6.0.0...
Building fltkhs-0.6.0.0...
Failed to install fltkhs-0.6.0.0
Build log ( /home/builder/.cabal/logs/ghc-8.4.3/fltkhs-0.6.0.0-HcDOA56TbWVCp3KeyeWKKO.log ):
cabal: Entering directory '/tmp/cabal-tmp-4821/fltkhs-0.6.0.0'
[1 of 1] Compiling Main             ( /tmp/cabal-tmp-4821/fltkhs-0.6.0.0/dist/setup/setup.hs, /tmp/cabal-tmp-4821/fltkhs-0.6.0.0/dist/setup/Main.o )
Linking /tmp/cabal-tmp-4821/fltkhs-0.6.0.0/dist/setup/setup ...
Running autoconf ...
Configuring fltkhs-0.6.0.0...
: WARNING: unrecognized options: --with-compiler
checking whether the C compiler works... yes
checking for C compiler default output file name... a.out
checking for suffix of executables... 
checking whether we are cross compiling... no
checking for suffix of object files... o
checking whether we are using the GNU C compiler... yes
checking whether /usr/bin/gcc accepts -g... yes
checking for /usr/bin/gcc option to accept ISO C89... none needed
checking for clang++... no
checking for g++... g++
checking whether we are using the GNU C++ compiler... yes
checking whether g++ accepts -g... yes
checking for fltk-config... fltk-config
checking how to run the C preprocessor... /usr/bin/gcc -E
checking for grep that handles long lines and -e... /bin/grep
checking for egrep... /bin/grep -E
checking for ANSI C header files... yes
checking for sys/types.h... yes
checking for sys/stat.h... yes
checking for stdlib.h... yes
checking for string.h... yes
checking for memory.h... yes
checking for strings.h... yes
checking for inttypes.h... yes
checking for stdint.h... yes
checking for unistd.h... yes
checking stddef.h usability... yes
checking stddef.h presence... yes
checking for stddef.h... yes
checking for stdint.h... (cached) yes
checking for stdlib.h... (cached) yes
checking for string.h... (cached) yes
checking for unistd.h... (cached) yes
checking for main in -ldl... yes
checking for stdlib.h... (cached) yes
checking for GNU libc compatible malloc... yes
checking for select... yes
checking for strdup... yes
checking for strerror... yes
checking for strrchr... yes
checking for strtol... yes
: creating ./config.status
config.status: creating Makefile
config.status: creating c-src/Makefile
config.status: creating c-examples/Makefile
config.status: creating fltkhs.buildinfo
config.status: creating config.h
: WARNING: unrecognized options: --with-compiler
==Compiling C bindings==
*** Compiling Fl_Simple_TerminalC.cpp...
In file included from Fl_Simple_TerminalC.cpp:1:0:
Fl_Simple_TerminalC.h:8:35: fatal error: FL/Fl_Simple_Terminal.H: No such file or directory
 #include "FL/Fl_Simple_Terminal.H"
                                   ^
compilation terminated.
make[1]: *** [Fl_Simple_TerminalC.o] Error 1
make: *** [src] Error 2
cabal: Leaving directory '/tmp/cabal-tmp-4821/fltkhs-0.6.0.0'
cabal: Error: some packages failed to install:
fltkhs-0.6.0.0-HcDOA56TbWVCp3KeyeWKKO failed during the building phase. The
exception was:
ExitFailure 2
fltkhs-themes-0.1.0.1-CYcSWsGWDK15IYnVWcZMN5 depends on fltkhs-themes-0.1.0.1
which failed to install.