Build #3 for haskanoid-0.1.5.4

[all reports]

Package haskanoid-0.1.5.4
Install DependencyFailed SDL-image-0.6.1.2
Docs NotTried
Tests NotTried
Time submitted 2017-11-02 08:36:06.139990468 UTC
Compiler ghc-8.0.2
OS linux
Arch x86_64
Dependencies IfElse-0.85, MissingH-1.4.0.1, SDL-0.6.5.1, SDL-image-0.6.1.2, SDL-mixer-0.6.2.0, SDL-ttf-0.6.2.2, Yampa-0.10.6.2, base-4.9.1.0, freenect-1.2.1, hcwiid-0.0.6.1, mtl-2.2.1, transformers-0.5.2.0, vector-0.12.0.1
Flags wiimote kinect

Build log

[view raw]

Resolving dependencies...
Configuring SDL-0.6.5.1...
Configuring call-stack-0.1.0...
Building call-stack-0.1.0...
Installed call-stack-0.1.0
Configuring hcwiid-0.0.6.1...
Building hcwiid-0.0.6.1...
Building SDL-0.6.5.1...
Installed hcwiid-0.0.6.1
Configuring mtl-2.2.1...
Building mtl-2.2.1...
Configuring network-2.6.3.2...
Installed mtl-2.2.1
Building network-2.6.3.2...
Warning: /tmp/pkgConf-SDL-0.6.513691330691125898167.1: Unrecognized field
dynamic-library-dirs on line 31
Configuring old-locale-1.0.0.7...
Installed SDL-0.6.5.1
Building old-locale-1.0.0.7...
Configuring primitive-0.6.2.0...
Installed old-locale-1.0.0.7
Building primitive-0.6.2.0...
Configuring random-1.1...
Installed network-2.6.3.2
Building random-1.1...
Configuring text-1.2.2.2...
Installed primitive-0.6.2.0
Building text-1.2.2.2...
Configuring HUnit-1.6.0.0...
Installed random-1.1
Building HUnit-1.6.0.0...
Installed HUnit-1.6.0.0
Configuring IfElse-0.85...
Building IfElse-0.85...
Configuring regex-base-0.93.2...
Installed IfElse-0.85
Building regex-base-0.93.2...
Configuring SDL-image-0.6.1.2...
Installed regex-base-0.93.2
Configuring SDL-mixer-0.6.2.0...
Failed to install SDL-image-0.6.1.2
Build log ( /home/builder/.cabal/logs/SDL-image-0.6.1.2.log ):
cabal: Entering directory '/tmp/cabal-tmp-28554/SDL-image-0.6.1.2'
[1 of 1] Compiling Main             ( /tmp/cabal-tmp-28554/SDL-image-0.6.1.2/dist/setup/setup.hs, /tmp/cabal-tmp-28554/SDL-image-0.6.1.2/dist/setup/Main.o )
Linking /tmp/cabal-tmp-28554/SDL-image-0.6.1.2/dist/setup/setup ...
Configuring SDL-image-0.6.1.2...
configure: WARNING: unrecognized options: --with-compiler
checking for sdl-config... /usr/bin/sdl-config
checking for gcc... /usr/bin/gcc
checking whether the C compiler works... no
configure: error: in `/tmp/cabal-tmp-28554/SDL-image-0.6.1.2':
configure: error: C compiler cannot create executables
See `config.log' for more details.
cabal: Leaving directory '/tmp/cabal-tmp-28554/SDL-image-0.6.1.2'
Configuring SDL-ttf-0.6.2.2...
Failed to install SDL-mixer-0.6.2.0
Build log ( /home/builder/.cabal/logs/SDL-mixer-0.6.2.0.log ):
cabal: Entering directory '/tmp/cabal-tmp-28563/SDL-mixer-0.6.2.0'
[1 of 1] Compiling Main             ( /tmp/cabal-tmp-28563/SDL-mixer-0.6.2.0/dist/setup/setup.hs, /tmp/cabal-tmp-28563/SDL-mixer-0.6.2.0/dist/setup/Main.o )
Linking /tmp/cabal-tmp-28563/SDL-mixer-0.6.2.0/dist/setup/setup ...
Configuring SDL-mixer-0.6.2.0...
configure: WARNING: unrecognized options: --with-compiler
checking for sdl-config... /usr/bin/sdl-config
checking for gcc... /usr/bin/gcc
checking whether the C compiler works... no
configure: error: in `/tmp/cabal-tmp-28563/SDL-mixer-0.6.2.0':
configure: error: C compiler cannot create executables
See `config.log' for more details.
cabal: Leaving directory '/tmp/cabal-tmp-28563/SDL-mixer-0.6.2.0'
Configuring old-time-1.1.0.3...
Installed text-1.2.2.2
Building old-time-1.1.0.3...
Configuring hslogger-1.2.10...
Failed to install SDL-ttf-0.6.2.2
Build log ( /home/builder/.cabal/logs/SDL-ttf-0.6.2.2.log ):
cabal: Entering directory '/tmp/cabal-tmp-28564/SDL-ttf-0.6.2.2'
[1 of 1] Compiling Main             ( /tmp/cabal-tmp-28564/SDL-ttf-0.6.2.2/dist/setup/setup.hs, /tmp/cabal-tmp-28564/SDL-ttf-0.6.2.2/dist/setup/Main.o )
Linking /tmp/cabal-tmp-28564/SDL-ttf-0.6.2.2/dist/setup/setup ...
Configuring SDL-ttf-0.6.2.2...
checking for sdl-config... /usr/bin/sdl-config
checking for gcc... /usr/bin/gcc
checking for C compiler default output file name... a.out
checking whether the C compiler works... yes
checking whether we are cross compiling... no
checking for suffix of executables... 
checking for suffix of object files... o
checking whether we are using the GNU C compiler... yes
checking whether /usr/bin/gcc accepts -g... yes
checking for /usr/bin/gcc option to accept ISO C89... none needed
checking for TTF_OpenFont in -lSDL_ttf... no
configure: error: *** SDL_ttf lib not found! Get SDL_ttf from
http://www.libsdl.org/projects/SDL_ttf/index.html
cabal: Leaving directory '/tmp/cabal-tmp-28564/SDL-ttf-0.6.2.2'
Building hslogger-1.2.10...
Configuring vector-0.12.0.1...
Installed old-time-1.1.0.3
Building vector-0.12.0.1...
Configuring Yampa-0.10.6.2...
Installed hslogger-1.2.10
Building Yampa-0.10.6.2...
Installed Yampa-0.10.6.2
Configuring regex-posix-0.95.2...
Building regex-posix-0.95.2...
Configuring parsec-3.1.11...
Installed regex-posix-0.95.2
Building parsec-3.1.11...
Configuring regex-compat-0.95.1...
Installed parsec-3.1.11
Building regex-compat-0.95.1...
Installed regex-compat-0.95.1
Configuring MissingH-1.4.0.1...
Building MissingH-1.4.0.1...
Installed vector-0.12.0.1
Configuring freenect-1.2.1...
Building freenect-1.2.1...
Installed freenect-1.2.1
Installed MissingH-1.4.0.1
cabal: Error: some packages failed to install:
SDL-image-0.6.1.2 failed during the configure step. The exception was:
ExitFailure 77
SDL-mixer-0.6.2.0 failed during the configure step. The exception was:
ExitFailure 77
SDL-ttf-0.6.2.2 failed during the configure step. The exception was:
ExitFailure 1
haskanoid-0.1.5.4 depends on SDL-image-0.6.1.2 which failed to install.