Build #1 for hbro-contrib-0.8.0.0

[all reports]

Package hbro-contrib-0.8.0.0
Install DependencyFailed zeromq3-haskell-0.5
Docs NotTried
Tests NotTried
Time submitted unknown
Compiler ghc-7.6.3
OS linux
Arch x86_64
Dependencies webkit-0.12.5, unix-2.6.0.1, time-1.4.0.1, text-0.11.2.3, process-1.1.0.2, pango-0.12.5.0, old-locale-1.0.0.5, network-2.4.1.2, hbro-1.1.2.0, gtk-0.12.5.0, glib-0.12.5.0, filepath-1.3.0.1, directory-1.2.0.1, base-4.6.0.1
Flags none

Code Coverage

No Code Coverage was submitted for this report.

Build log

[view raw]

Resolving dependencies...
Configuring base-unicode-symbols-0.2.2.4...
Building base-unicode-symbols-0.2.2.4...
Preprocessing library base-unicode-symbols-0.2.2.4...
[ 1 of 12] Compiling Data.Ord.Unicode ( Data/Ord/Unicode.hs, dist/build/Data/Ord/Unicode.o )
[ 2 of 12] Compiling Data.Monoid.Unicode ( Data/Monoid/Unicode.hs, dist/build/Data/Monoid/Unicode.o )
[ 3 of 12] Compiling Data.List.Unicode ( Data/List/Unicode.hs, dist/build/Data/List/Unicode.o )
[ 4 of 12] Compiling Data.Function.Unicode ( Data/Function/Unicode.hs, dist/build/Data/Function/Unicode.o )
[ 5 of 12] Compiling Data.Foldable.Unicode ( Data/Foldable/Unicode.hs, dist/build/Data/Foldable/Unicode.o )
[ 6 of 12] Compiling Data.Eq.Unicode  ( Data/Eq/Unicode.hs, dist/build/Data/Eq/Unicode.o )
[ 7 of 12] Compiling Data.Bool.Unicode ( Data/Bool/Unicode.hs, dist/build/Data/Bool/Unicode.o )
[ 8 of 12] Compiling Prelude.Unicode  ( Prelude/Unicode.hs, dist/build/Prelude/Unicode.o )
[ 9 of 12] Compiling Control.Monad.Unicode ( Control/Monad/Unicode.hs, dist/build/Control/Monad/Unicode.o )
[10 of 12] Compiling Control.Category.Unicode ( Control/Category/Unicode.hs, dist/build/Control/Category/Unicode.o )
[11 of 12] Compiling Control.Arrow.Unicode ( Control/Arrow/Unicode.hs, dist/build/Control/Arrow/Unicode.o )
[12 of 12] Compiling Control.Applicative.Unicode ( Control/Applicative/Unicode.hs, dist/build/Control/Applicative/Unicode.o )
In-place registering base-unicode-symbols-0.2.2.4...
Running Haddock for base-unicode-symbols-0.2.2.4...
Running hscolour for base-unicode-symbols-0.2.2.4...
Preprocessing library base-unicode-symbols-0.2.2.4...
Preprocessing library base-unicode-symbols-0.2.2.4...
Haddock coverage:
 100% (  5 /  5) in 'Data.Ord.Unicode'
 100% (  3 /  3) in 'Data.Monoid.Unicode'
 100% ( 10 / 10) in 'Data.List.Unicode'
 100% (  2 /  2) in 'Data.Function.Unicode'
 100% (  5 /  5) in 'Data.Foldable.Unicode'
 100% (  4 /  4) in 'Data.Eq.Unicode'
 100% (  4 /  4) in 'Data.Bool.Unicode'
 100% ( 21 / 21) in 'Prelude.Unicode'
 100% (  4 /  4) in 'Control.Monad.Unicode'
 100% (  4 /  4) in 'Control.Category.Unicode'
 100% (  6 /  6) in 'Control.Arrow.Unicode'
 100% (  3 /  3) in 'Control.Applicative.Unicode'
Documentation created: dist/doc/html/base-unicode-symbols/index.html
Installing library in
/srv/hackage/var/build/tmp-install/lib/x86_64-linux-ghc-7.6.3/base-unicode-symbols-0.2.2.4
Registering base-unicode-symbols-0.2.2.4...
Installed base-unicode-symbols-0.2.2.4
Configuring cond-0.4.0.2...
Building cond-0.4.0.2...
Preprocessing library cond-0.4.0.2...
[1 of 2] Compiling Data.Algebra.Boolean ( src/Data/Algebra/Boolean.hs, dist/build/Data/Algebra/Boolean.o )
[2 of 2] Compiling Control.Conditional ( src/Control/Conditional.hs, dist/build/Control/Conditional.o )
In-place registering cond-0.4.0.2...
Running Haddock for cond-0.4.0.2...
Running hscolour for cond-0.4.0.2...
Preprocessing library cond-0.4.0.2...
Preprocessing library cond-0.4.0.2...
Haddock coverage:
  75% (  3 /  4) in 'Data.Algebra.Boolean'
 100% ( 47 / 47) in 'Control.Conditional'
Documentation created: dist/doc/html/cond/index.html
Installing library in
/srv/hackage/var/build/tmp-install/lib/x86_64-linux-ghc-7.6.3/cond-0.4.0.2
Registering cond-0.4.0.2...
Installed cond-0.4.0.2
Configuring data-default-class-0.0.1...
Building data-default-class-0.0.1...
Preprocessing library data-default-class-0.0.1...
[1 of 1] Compiling Data.Default.Class ( Data/Default/Class.hs, dist/build/Data/Default/Class.o )
In-place registering data-default-class-0.0.1...
Running Haddock for data-default-class-0.0.1...
Running hscolour for data-default-class-0.0.1...
Preprocessing library data-default-class-0.0.1...
Preprocessing library data-default-class-0.0.1...
Haddock coverage:
  67% (  2 /  3) in 'Data.Default.Class'
Documentation created: dist/doc/html/data-default-class/index.html
Installing library in
/srv/hackage/var/build/tmp-install/lib/x86_64-linux-ghc-7.6.3/data-default-class-0.0.1
Registering data-default-class-0.0.1...
Installed data-default-class-0.0.1
Configuring dlist-0.6.0.1...
Building dlist-0.6.0.1...
Preprocessing library dlist-0.6.0.1...
[1 of 1] Compiling Data.DList       ( Data/DList.hs, dist/build/Data/DList.o )
In-place registering dlist-0.6.0.1...
Running Haddock for dlist-0.6.0.1...
Running hscolour for dlist-0.6.0.1...
Preprocessing library dlist-0.6.0.1...
Preprocessing library dlist-0.6.0.1...
Haddock coverage:
  95% ( 20 / 21) in 'Data.DList'
Documentation created: dist/doc/html/dlist/index.html
Installing library in
/srv/hackage/var/build/tmp-install/lib/x86_64-linux-ghc-7.6.3/dlist-0.6.0.1
Registering dlist-0.6.0.1...
Installed dlist-0.6.0.1
Configuring executable-path-0.0.3...
Building executable-path-0.0.3...
Preprocessing library executable-path-0.0.3...
[1 of 2] Compiling System.Environment.Executable.Linux ( System/Environment/Executable/Linux.hs, dist/build/System/Environment/Executable/Linux.o )
[2 of 2] Compiling System.Environment.Executable ( System/Environment/Executable.hs, dist/build/System/Environment/Executable.o )
In-place registering executable-path-0.0.3...
Running Haddock for executable-path-0.0.3...
Running hscolour for executable-path-0.0.3...
Preprocessing library executable-path-0.0.3...
Preprocessing library executable-path-0.0.3...
Haddock coverage:
   0% (  0 /  3) in 'System.Environment.Executable.Linux'
  40% (  2 /  5) in 'System.Environment.Executable'
Documentation created: dist/doc/html/executable-path/index.html
Installing library in
/srv/hackage/var/build/tmp-install/lib/x86_64-linux-ghc-7.6.3/executable-path-0.0.3
Registering executable-path-0.0.3...
Installed executable-path-0.0.3
Configuring extensible-exceptions-0.1.1.4...
Building extensible-exceptions-0.1.1.4...
Preprocessing library extensible-exceptions-0.1.1.4...
[1 of 1] Compiling Control.Exception.Extensible ( Control/Exception/Extensible.hs, dist/build/Control/Exception/Extensible.o )
In-place registering extensible-exceptions-0.1.1.4...
Running Haddock for extensible-exceptions-0.1.1.4...
Running hscolour for extensible-exceptions-0.1.1.4...
Preprocessing library extensible-exceptions-0.1.1.4...
Preprocessing library extensible-exceptions-0.1.1.4...
Haddock coverage:
 100% (  2 /  2) in 'Control.Exception.Extensible'
Documentation created: dist/doc/html/extensible-exceptions/index.html
Installing library in
/srv/hackage/var/build/tmp-install/lib/x86_64-linux-ghc-7.6.3/extensible-exceptions-0.1.1.4
Registering extensible-exceptions-0.1.1.4...
Installed extensible-exceptions-0.1.1.4
Configuring generic-deriving-1.6.2...
Building generic-deriving-1.6.2...
Preprocessing library generic-deriving-1.6.2...
[ 1 of 14] Compiling Generics.Deriving.Instances ( src/Generics/Deriving/Instances.hs, dist/build/Generics/Deriving/Instances.o )
[ 2 of 14] Compiling Generics.Deriving.Base ( src/Generics/Deriving/Base.hs, dist/build/Generics/Deriving/Base.o )
[ 3 of 14] Compiling Generics.Deriving.Copoint ( src/Generics/Deriving/Copoint.hs, dist/build/Generics/Deriving/Copoint.o )
[ 4 of 14] Compiling Generics.Deriving.ConNames ( src/Generics/Deriving/ConNames.hs, dist/build/Generics/Deriving/ConNames.o )
[ 5 of 14] Compiling Generics.Deriving.Eq ( src/Generics/Deriving/Eq.hs, dist/build/Generics/Deriving/Eq.o )
[ 6 of 14] Compiling Generics.Deriving.Enum ( src/Generics/Deriving/Enum.hs, dist/build/Generics/Deriving/Enum.o )
[ 7 of 14] Compiling Generics.Deriving.Functor ( src/Generics/Deriving/Functor.hs, dist/build/Generics/Deriving/Functor.o )
[ 8 of 14] Compiling Generics.Deriving.Show ( src/Generics/Deriving/Show.hs, dist/build/Generics/Deriving/Show.o )
[ 9 of 14] Compiling Generics.Deriving.Uniplate ( src/Generics/Deriving/Uniplate.hs, dist/build/Generics/Deriving/Uniplate.o )
[10 of 14] Compiling Generics.Deriving.Foldable ( src/Generics/Deriving/Foldable.hs, dist/build/Generics/Deriving/Foldable.o )
[11 of 14] Compiling Generics.Deriving.Monoid ( src/Generics/Deriving/Monoid.hs, dist/build/Generics/Deriving/Monoid.o )
[12 of 14] Compiling Generics.Deriving.Traversable ( src/Generics/Deriving/Traversable.hs, dist/build/Generics/Deriving/Traversable.o )
[13 of 14] Compiling Generics.Deriving.TH ( src/Generics/Deriving/TH.hs, dist/build/Generics/Deriving/TH.o )
[14 of 14] Compiling Generics.Deriving ( src/Generics/Deriving.hs, dist/build/Generics/Deriving.o )
In-place registering generic-deriving-1.6.2...
Running Haddock for generic-deriving-1.6.2...
Running hscolour for generic-deriving-1.6.2...
Preprocessing library generic-deriving-1.6.2...
Preprocessing library generic-deriving-1.6.2...
Haddock coverage:
   0% (  0 /  1) in 'Generics.Deriving.Instances'
  97% ( 35 / 36) in 'Generics.Deriving.Base'
  40% (  2 /  5) in 'Generics.Deriving.Copoint'
  75% (  3 /  4) in 'Generics.Deriving.ConNames'
  33% (  1 /  3) in 'Generics.Deriving.Eq'
  31% (  4 / 13) in 'Generics.Deriving.Enum'
  40% (  2 /  5) in 'Generics.Deriving.Functor'
  40% (  2 /  5) in 'Generics.Deriving.Show'
  18% (  3 / 17) in 'Generics.Deriving.Uniplate'
  14% (  3 / 22) in 'Generics.Deriving.Foldable'
  64% (  9 / 14) in 'Generics.Deriving.Monoid'
  40% (  2 /  5) in 'Generics.Deriving.Traversable'
 100% (  5 /  5) in 'Generics.Deriving.TH'
  89% (  8 /  9) in 'Generics.Deriving'
Warning: Generics.Deriving.Copoint: could not find link destinations for:
    Generics.Deriving.Copoint.GCopoint'
Warning: Generics.Deriving.Enum: could not find link destinations for:
    Generics.Deriving.Enum.Enum'
Warning: Generics.Deriving.Functor: could not find link destinations for:
    Generics.Deriving.Functor.GFunctor'
Warning: Generics.Deriving.Show: could not find link destinations for:
    Generics.Deriving.Show.GShow'
Warning: Generics.Deriving.Uniplate: could not find link destinations for:
    Generics.Deriving.Uniplate.Uniplate' Generics.Deriving.Uniplate.Context'
Warning: Generics.Deriving.Foldable: could not find link destinations for:
    Generics.Deriving.Foldable.GFoldable'
Warning: Generics.Deriving.Monoid: could not find link destinations for:
    Generics.Deriving.Monoid.GMonoid' Generics.Deriving.Monoid.Monoid'
Warning: Generics.Deriving.Traversable: could not find link destinations for:
    Generics.Deriving.Traversable.GTraversable'
Warning: Generics.Deriving.TH: could not find link destinations for:
    Generics.Deriving.TH.deriveRepresentable0
Documentation created: dist/doc/html/generic-deriving/index.html
Installing library in
/srv/hackage/var/build/tmp-install/lib/x86_64-linux-ghc-7.6.3/generic-deriving-1.6.2
Registering generic-deriving-1.6.2...
Installed generic-deriving-1.6.2
[1 of 1] Compiling Main             ( /tmp/ghc-paths-0.1.0.9-29618/ghc-paths-0.1.0.9/Setup.hs, /tmp/ghc-paths-0.1.0.9-29618/ghc-paths-0.1.0.9/dist/setup/Main.o )
Linking /tmp/ghc-paths-0.1.0.9-29618/ghc-paths-0.1.0.9/dist/setup/setup ...
Configuring ghc-paths-0.1.0.9...
Building ghc-paths-0.1.0.9...
Preprocessing library ghc-paths-0.1.0.9...
[1 of 1] Compiling GHC.Paths        ( GHC/Paths.hs, dist/build/GHC/Paths.o )
In-place registering ghc-paths-0.1.0.9...
Running Haddock for ghc-paths-0.1.0.9...
Running hscolour for ghc-paths-0.1.0.9...
Preprocessing library ghc-paths-0.1.0.9...
Preprocessing library ghc-paths-0.1.0.9...
Warning: The documentation for the following packages are not installed. No
links will be generated to these packages: rts-1.0
Haddock coverage:
   0% (  0 /  5) in 'GHC.Paths'
Documentation created: dist/doc/html/ghc-paths/index.html
Installing library in
/srv/hackage/var/build/tmp-install/lib/x86_64-linux-ghc-7.6.3/ghc-paths-0.1.0.9
Registering ghc-paths-0.1.0.9...
Installed ghc-paths-0.1.0.9
Configuring hashable-1.2.1.0...
Building hashable-1.2.1.0...
Preprocessing library hashable-1.2.1.0...
[1 of 3] Compiling Data.Hashable.Class ( Data/Hashable/Class.hs, dist/build/Data/Hashable/Class.o )
[2 of 3] Compiling Data.Hashable.Generic ( Data/Hashable/Generic.hs, dist/build/Data/Hashable/Generic.o )
[3 of 3] Compiling Data.Hashable    ( Data/Hashable.hs, dist/build/Data/Hashable.o )
In-place registering hashable-1.2.1.0...
Running Haddock for hashable-1.2.1.0...
Running hscolour for hashable-1.2.1.0...
Preprocessing library hashable-1.2.1.0...
Preprocessing library hashable-1.2.1.0...
Warning: The documentation for the following packages are not installed. No
links will be generated to these packages: text-0.11.2.3
Haddock coverage:
 100% ( 11 / 11) in 'Data.Hashable.Class'
 100% (  1 /  1) in 'Data.Hashable.Generic'
 100% ( 22 / 22) in 'Data.Hashable'
Warning: Data.Hashable: could not find link destinations for:
    Data.Text.Internal.Text Data.Text.Lazy.Internal.Text Data.Hashable.Class.GHashable
Documentation created: dist/doc/html/hashable/index.html
Installing library in
/srv/hackage/var/build/tmp-install/lib/x86_64-linux-ghc-7.6.3/hashable-1.2.1.0
Registering hashable-1.2.1.0...
Installed hashable-1.2.1.0
Configuring io-storage-0.3...
Building io-storage-0.3...
Preprocessing library io-storage-0.3...
[1 of 1] Compiling System.IO.Storage ( System/IO/Storage.hs, dist/build/System/IO/Storage.o )
In-place registering io-storage-0.3...
Running Haddock for io-storage-0.3...
Running hscolour for io-storage-0.3...
Preprocessing library io-storage-0.3...
Preprocessing library io-storage-0.3...
Haddock coverage:
 100% (  6 /  6) in 'System.IO.Storage'
Documentation created: dist/doc/html/io-storage/index.html
Installing library in
/srv/hackage/var/build/tmp-install/lib/x86_64-linux-ghc-7.6.3/io-storage-0.3
Registering io-storage-0.3...
Installed io-storage-0.3
Configuring monads-tf-0.1.0.1...
Building monads-tf-0.1.0.1...
Preprocessing library monads-tf-0.1.0.1...
[ 1 of 21] Compiling Control.Monad.Identity ( Control/Monad/Identity.hs, dist/build/Control/Monad/Identity.o )
[ 2 of 21] Compiling Control.Monad.Cont.Class ( Control/Monad/Cont/Class.hs, dist/build/Control/Monad/Cont/Class.o )
[ 3 of 21] Compiling Control.Monad.Trans ( Control/Monad/Trans.hs, dist/build/Control/Monad/Trans.o )
[ 4 of 21] Compiling Control.Monad.Error.Class ( Control/Monad/Error/Class.hs, dist/build/Control/Monad/Error/Class.o )
[ 5 of 21] Compiling Control.Monad.Error ( Control/Monad/Error.hs, dist/build/Control/Monad/Error.o )
[ 6 of 21] Compiling Control.Monad.List ( Control/Monad/List.hs, dist/build/Control/Monad/List.o )
[ 7 of 21] Compiling Control.Monad.Reader.Class ( Control/Monad/Reader/Class.hs, dist/build/Control/Monad/Reader/Class.o )
[ 8 of 21] Compiling Control.Monad.Reader ( Control/Monad/Reader.hs, dist/build/Control/Monad/Reader.o )
[ 9 of 21] Compiling Control.Monad.State.Class ( Control/Monad/State/Class.hs, dist/build/Control/Monad/State/Class.o )
[10 of 21] Compiling Control.Monad.Writer.Class ( Control/Monad/Writer/Class.hs, dist/build/Control/Monad/Writer/Class.o )
[11 of 21] Compiling Control.Monad.RWS.Class ( Control/Monad/RWS/Class.hs, dist/build/Control/Monad/RWS/Class.o )
[12 of 21] Compiling Control.Monad.RWS.Lazy ( Control/Monad/RWS/Lazy.hs, dist/build/Control/Monad/RWS/Lazy.o )
[13 of 21] Compiling Control.Monad.RWS ( Control/Monad/RWS.hs, dist/build/Control/Monad/RWS.o )
[14 of 21] Compiling Control.Monad.RWS.Strict ( Control/Monad/RWS/Strict.hs, dist/build/Control/Monad/RWS/Strict.o )
[15 of 21] Compiling Control.Monad.State.Lazy ( Control/Monad/State/Lazy.hs, dist/build/Control/Monad/State/Lazy.o )
[16 of 21] Compiling Control.Monad.State ( Control/Monad/State.hs, dist/build/Control/Monad/State.o )
[17 of 21] Compiling Control.Monad.State.Strict ( Control/Monad/State/Strict.hs, dist/build/Control/Monad/State/Strict.o )
[18 of 21] Compiling Control.Monad.Writer.Lazy ( Control/Monad/Writer/Lazy.hs, dist/build/Control/Monad/Writer/Lazy.o )
[19 of 21] Compiling Control.Monad.Writer ( Control/Monad/Writer.hs, dist/build/Control/Monad/Writer.o )
[20 of 21] Compiling Control.Monad.Writer.Strict ( Control/Monad/Writer/Strict.hs, dist/build/Control/Monad/Writer/Strict.o )
[21 of 21] Compiling Control.Monad.Cont ( Control/Monad/Cont.hs, dist/build/Control/Monad/Cont.o )
In-place registering monads-tf-0.1.0.1...
Running Haddock for monads-tf-0.1.0.1...
Running hscolour for monads-tf-0.1.0.1...
Preprocessing library monads-tf-0.1.0.1...
Preprocessing library monads-tf-0.1.0.1...
Warning: The documentation for the following packages are not installed. No
links will be generated to these packages: transformers-0.3.0.0
Haddock coverage:
Warning: monads-tf-0.1.0.1:Control.Monad.Identity: Could not find documentation for exported module: Data.Functor.Identity
 100% (  1 /  1) in 'Control.Monad.Identity'
  50% (  1 /  2) in 'Control.Monad.Cont.Class'
Warning: monads-tf-0.1.0.1:Control.Monad.Trans: Could not find documentation for exported module: Control.Monad.Trans.Class
Warning: monads-tf-0.1.0.1:Control.Monad.Trans: Could not find documentation for exported module: Control.Monad.IO.Class
 100% (  1 /  1) in 'Control.Monad.Trans'
Warning: Control.Monad.Error.Class: We do not support associated types in instances yet. These instances are affected:
Control.Monad.Error.Class.MonadError GHC.Types.IO, Control.Monad.Trans.Error.Error e =>
Control.Monad.Error.Class.MonadError (Data.Either.Either e), (GHC.Base.Monad m, Control.Monad.Trans.Error.Error e) =>
Control.Monad.Error.Class.MonadError (Control.Monad.Trans.Error.ErrorT e m), Control.Monad.Error.Class.MonadError m =>
Control.Monad.Error.Class.MonadError (Control.Monad.Trans.Identity.IdentityT m), Control.Monad.Error.Class.MonadError m =>
Control.Monad.Error.Class.MonadError (Control.Monad.Trans.List.ListT m), Control.Monad.Error.Class.MonadError m =>
Control.Monad.Error.Class.MonadError (Control.Monad.Trans.Maybe.MaybeT m), Control.Monad.Error.Class.MonadError m =>
Control.Monad.Error.Class.MonadError (Control.Monad.Trans.Reader.ReaderT r m), (Data.Monoid.Monoid w, Control.Monad.Error.Class.MonadError m) =>
Control.Monad.Error.Class.MonadError (Control.Monad.Trans.RWS.Lazy.RWST r w s m), (Data.Monoid.Monoid w, Control.Monad.Error.Class.MonadError m) =>
Control.Monad.Error.Class.MonadError (Control.Monad.Trans.RWS.Strict.RWST r w s m), Control.Monad.Error.Class.MonadError m =>
Control.Monad.Error.Class.MonadError (Control.Monad.Trans.State.Lazy.StateT s m), Control.Monad.Error.Class.MonadError m =>
Control.Monad.Error.Class.MonadError (Control.Monad.Trans.State.Strict.StateT s m), (Data.Monoid.Monoid w, Control.Monad.Error.Class.MonadError m) =>
Control.Monad.Error.Class.MonadError (Control.Monad.Trans.Writer.Lazy.WriterT w m), (Data.Monoid.Monoid w, Control.Monad.Error.Class.MonadError m) =>
Control.Monad.Error.Class.MonadError (Control.Monad.Trans.Writer.Strict.WriterT w m)
Warning: Couldn't find .haddock for export Control.Monad.Trans.Error.Error
  67% (  2 /  3) in 'Control.Monad.Error.Class'
Warning: Couldn't find .haddock for export Control.Monad.Trans.Error.Error
Warning: Couldn't find .haddock for export Control.Monad.Trans.Error.ErrorT
Warning: Couldn't find .haddock for export Control.Monad.Trans.Error.mapErrorT
  79% ( 11 / 14) in 'Control.Monad.Error'
Warning: Couldn't find .haddock for export Control.Monad.Trans.List.ListT
Warning: Couldn't find .haddock for export Control.Monad.Trans.List.mapListT
  60% (  3 /  5) in 'Control.Monad.List'
Warning: Control.Monad.Reader.Class: We do not support associated types in instances yet. These instances are affected:
Control.Monad.Reader.Class.MonadReader ((->) r), GHC.Base.Monad m =>
Control.Monad.Reader.Class.MonadReader (Control.Monad.Trans.Reader.ReaderT r m), (Data.Monoid.Monoid w, GHC.Base.Monad m) =>
Control.Monad.Reader.Class.MonadReader (Control.Monad.Trans.RWS.Lazy.RWST r w s m), (Data.Monoid.Monoid w, GHC.Base.Monad m) =>
Control.Monad.Reader.Class.MonadReader (Control.Monad.Trans.RWS.Strict.RWST r w s m), Control.Monad.Reader.Class.MonadReader m =>
Control.Monad.Reader.Class.MonadReader (Control.Monad.Trans.Cont.ContT r m), (Control.Monad.Trans.Error.Error e,
 Control.Monad.Reader.Class.MonadReader m) =>
Control.Monad.Reader.Class.MonadReader (Control.Monad.Trans.Error.ErrorT e m), Control.Monad.Reader.Class.MonadReader m =>
Control.Monad.Reader.Class.MonadReader (Control.Monad.Trans.Identity.IdentityT m), Control.Monad.Reader.Class.MonadReader m =>
Control.Monad.Reader.Class.MonadReader (Control.Monad.Trans.List.ListT m), Control.Monad.Reader.Class.MonadReader m =>
Control.Monad.Reader.Class.MonadReader (Control.Monad.Trans.Maybe.MaybeT m), Control.Monad.Reader.Class.MonadReader m =>
Control.Monad.Reader.Class.MonadReader (Control.Monad.Trans.State.Lazy.StateT s m), Control.Monad.Reader.Class.MonadReader m =>
Control.Monad.Reader.Class.MonadReader (Control.Monad.Trans.State.Strict.StateT s m), (Data.Monoid.Monoid w, Control.Monad.Reader.Class.MonadReader m) =>
Control.Monad.Reader.Class.MonadReader (Control.Monad.Trans.Writer.Lazy.WriterT w m), (Data.Monoid.Monoid w, Control.Monad.Reader.Class.MonadReader m) =>
Control.Monad.Reader.Class.MonadReader (Control.Monad.Trans.Writer.Strict.WriterT w m)
 100% (  3 /  3) in 'Control.Monad.Reader.Class'
Warning: Couldn't find .haddock for export Control.Monad.Trans.Reader.Reader
Warning: Couldn't find .haddock for export Control.Monad.Trans.Reader.runReader
Warning: Couldn't find .haddock for export Control.Monad.Trans.Reader.mapReader
Warning: Couldn't find .haddock for export Control.Monad.Trans.Reader.withReader
Warning: Couldn't find .haddock for export Control.Monad.Trans.Reader.ReaderT
Warning: Couldn't find .haddock for export Control.Monad.Trans.Reader.mapReaderT
Warning: Couldn't find .haddock for export Control.Monad.Trans.Reader.withReaderT
  68% ( 15 / 22) in 'Control.Monad.Reader'
Warning: Control.Monad.State.Class: We do not support associated types in instances yet. These instances are affected:
GHC.Base.Monad m =>
Control.Monad.State.Class.MonadState (Control.Monad.Trans.State.Lazy.StateT s m), GHC.Base.Monad m =>
Control.Monad.State.Class.MonadState (Control.Monad.Trans.State.Strict.StateT s m), (GHC.Base.Monad m, Data.Monoid.Monoid w) =>
Control.Monad.State.Class.MonadState (Control.Monad.Trans.RWS.Lazy.RWST r w s m), (GHC.Base.Monad m, Data.Monoid.Monoid w) =>
Control.Monad.State.Class.MonadState (Control.Monad.Trans.RWS.Strict.RWST r w s m), Control.Monad.State.Class.MonadState m =>
Control.Monad.State.Class.MonadState (Control.Monad.Trans.Cont.ContT r m), (Control.Monad.Trans.Error.Error e,
 Control.Monad.State.Class.MonadState m) =>
Control.Monad.State.Class.MonadState (Control.Monad.Trans.Error.ErrorT e m), Control.Monad.State.Class.MonadState m =>
Control.Monad.State.Class.MonadState (Control.Monad.Trans.Identity.IdentityT m), Control.Monad.State.Class.MonadState m =>
Control.Monad.State.Class.MonadState (Control.Monad.Trans.List.ListT m), Control.Monad.State.Class.MonadState m =>
Control.Monad.State.Class.MonadState (Control.Monad.Trans.Maybe.MaybeT m), Control.Monad.State.Class.MonadState m =>
Control.Monad.State.Class.MonadState (Control.Monad.Trans.Reader.ReaderT r m), (Data.Monoid.Monoid w, Control.Monad.State.Class.MonadState m) =>
Control.Monad.State.Class.MonadState (Control.Monad.Trans.Writer.Lazy.WriterT w m), (Data.Monoid.Monoid w, Control.Monad.State.Class.MonadState m) =>
Control.Monad.State.Class.MonadState (Control.Monad.Trans.Writer.Strict.WriterT w m)
 100% (  4 /  4) in 'Control.Monad.State.Class'
Warning: Control.Monad.Writer.Class: We do not support associated types in instances yet. These instances are affected:
(Data.Monoid.Monoid w, GHC.Base.Monad m) =>
Control.Monad.Writer.Class.MonadWriter (Control.Monad.Trans.Writer.Lazy.WriterT w m), (Data.Monoid.Monoid w, GHC.Base.Monad m) =>
Control.Monad.Writer.Class.MonadWriter (Control.Monad.Trans.Writer.Strict.WriterT w m), (Data.Monoid.Monoid w, GHC.Base.Monad m) =>
Control.Monad.Writer.Class.MonadWriter (Control.Monad.Trans.RWS.Lazy.RWST r w s m), (Data.Monoid.Monoid w, GHC.Base.Monad m) =>
Control.Monad.Writer.Class.MonadWriter (Control.Monad.Trans.RWS.Strict.RWST r w s m), (Control.Monad.Trans.Error.Error e,
 Control.Monad.Writer.Class.MonadWriter m) =>
Control.Monad.Writer.Class.MonadWriter (Control.Monad.Trans.Error.ErrorT e m), Control.Monad.Writer.Class.MonadWriter m =>
Control.Monad.Writer.Class.MonadWriter (Control.Monad.Trans.Identity.IdentityT m), Control.Monad.Writer.Class.MonadWriter m =>
Control.Monad.Writer.Class.MonadWriter (Control.Monad.Trans.Maybe.MaybeT m), Control.Monad.Writer.Class.MonadWriter m =>
Control.Monad.Writer.Class.MonadWriter (Control.Monad.Trans.Reader.ReaderT r m), Control.Monad.Writer.Class.MonadWriter m =>
Control.Monad.Writer.Class.MonadWriter (Control.Monad.Trans.State.Lazy.StateT s m), Control.Monad.Writer.Class.MonadWriter m =>
Control.Monad.Writer.Class.MonadWriter (Control.Monad.Trans.State.Strict.StateT s m)
  25% (  1 /  4) in 'Control.Monad.Writer.Class'
  80% (  4 /  5) in 'Control.Monad.RWS.Class'
Warning: Couldn't find .haddock for export Control.Monad.Trans.RWS.Lazy.RWS
Warning: Couldn't find .haddock for export Control.Monad.Trans.RWS.Lazy.runRWS
Warning: Couldn't find .haddock for export Control.Monad.Trans.RWS.Lazy.evalRWS
Warning: Couldn't find .haddock for export Control.Monad.Trans.RWS.Lazy.execRWS
Warning: Couldn't find .haddock for export Control.Monad.Trans.RWS.Lazy.mapRWS
Warning: Couldn't find .haddock for export Control.Monad.Trans.RWS.Lazy.withRWS
Warning: Couldn't find .haddock for export Control.Monad.Trans.RWS.Lazy.RWST
Warning: Couldn't find .haddock for export Control.Monad.Trans.RWS.Lazy.evalRWST
Warning: Couldn't find .haddock for export Control.Monad.Trans.RWS.Lazy.execRWST
Warning: Couldn't find .haddock for export Control.Monad.Trans.RWS.Lazy.mapRWST
Warning: Couldn't find .haddock for export Control.Monad.Trans.RWS.Lazy.withRWST
  45% (  9 / 20) in 'Control.Monad.RWS.Lazy'
 100% (  2 /  2) in 'Control.Monad.RWS'
Warning: Couldn't find .haddock for export Control.Monad.Trans.RWS.Strict.RWS
Warning: Couldn't find .haddock for export Control.Monad.Trans.RWS.Strict.runRWS
Warning: Couldn't find .haddock for export Control.Monad.Trans.RWS.Strict.evalRWS
Warning: Couldn't find .haddock for export Control.Monad.Trans.RWS.Strict.execRWS
Warning: Couldn't find .haddock for export Control.Monad.Trans.RWS.Strict.mapRWS
Warning: Couldn't find .haddock for export Control.Monad.Trans.RWS.Strict.withRWS
Warning: Couldn't find .haddock for export Control.Monad.Trans.RWS.Strict.RWST
Warning: Couldn't find .haddock for export Control.Monad.Trans.RWS.Strict.evalRWST
Warning: Couldn't find .haddock for export Control.Monad.Trans.RWS.Strict.execRWST
Warning: Couldn't find .haddock for export Control.Monad.Trans.RWS.Strict.mapRWST
Warning: Couldn't find .haddock for export Control.Monad.Trans.RWS.Strict.withRWST
  45% (  9 / 20) in 'Control.Monad.RWS.Strict'
Warning: Couldn't find .haddock for export Control.Monad.Trans.State.Lazy.State
Warning: Couldn't find .haddock for export Control.Monad.Trans.State.Lazy.runState
Warning: Couldn't find .haddock for export Control.Monad.Trans.State.Lazy.evalState
Warning: Couldn't find .haddock for export Control.Monad.Trans.State.Lazy.execState
Warning: Couldn't find .haddock for export Control.Monad.Trans.State.Lazy.mapState
Warning: Couldn't find .haddock for export Control.Monad.Trans.State.Lazy.withState
Warning: Couldn't find .haddock for export Control.Monad.Trans.State.Lazy.StateT
Warning: Couldn't find .haddock for export Control.Monad.Trans.State.Lazy.evalStateT
Warning: Couldn't find .haddock for export Control.Monad.Trans.State.Lazy.execStateT
Warning: Couldn't find .haddock for export Control.Monad.Trans.State.Lazy.mapStateT
Warning: Couldn't find .haddock for export Control.Monad.Trans.State.Lazy.withStateT
  52% ( 12 / 23) in 'Control.Monad.State.Lazy'
 100% (  2 /  2) in 'Control.Monad.State'
Warning: Couldn't find .haddock for export Control.Monad.Trans.State.Strict.State
Warning: Couldn't find .haddock for export Control.Monad.Trans.State.Strict.runState
Warning: Couldn't find .haddock for export Control.Monad.Trans.State.Strict.evalState
Warning: Couldn't find .haddock for export Control.Monad.Trans.State.Strict.execState
Warning: Couldn't find .haddock for export Control.Monad.Trans.State.Strict.mapState
Warning: Couldn't find .haddock for export Control.Monad.Trans.State.Strict.withState
Warning: Couldn't find .haddock for export Control.Monad.Trans.State.Strict.StateT
Warning: Couldn't find .haddock for export Control.Monad.Trans.State.Strict.evalStateT
Warning: Couldn't find .haddock for export Control.Monad.Trans.State.Strict.execStateT
Warning: Couldn't find .haddock for export Control.Monad.Trans.State.Strict.mapStateT
Warning: Couldn't find .haddock for export Control.Monad.Trans.State.Strict.withStateT
  52% ( 12 / 23) in 'Control.Monad.State.Strict'
Warning: Couldn't find .haddock for export Control.Monad.Trans.Writer.Lazy.Writer
Warning: Couldn't find .haddock for export Control.Monad.Trans.Writer.Lazy.runWriter
Warning: Couldn't find .haddock for export Control.Monad.Trans.Writer.Lazy.execWriter
Warning: Couldn't find .haddock for export Control.Monad.Trans.Writer.Lazy.mapWriter
Warning: Couldn't find .haddock for export Control.Monad.Trans.Writer.Lazy.WriterT
Warning: Couldn't find .haddock for export Control.Monad.Trans.Writer.Lazy.execWriterT
Warning: Couldn't find .haddock for export Control.Monad.Trans.Writer.Lazy.mapWriterT
  44% (  8 / 18) in 'Control.Monad.Writer.Lazy'
 100% (  2 /  2) in 'Control.Monad.Writer'
Warning: Couldn't find .haddock for export Control.Monad.Trans.Writer.Strict.Writer
Warning: Couldn't find .haddock for export Control.Monad.Trans.Writer.Strict.runWriter
Warning: Couldn't find .haddock for export Control.Monad.Trans.Writer.Strict.execWriter
Warning: Couldn't find .haddock for export Control.Monad.Trans.Writer.Strict.mapWriter
Warning: Couldn't find .haddock for export Control.Monad.Trans.Writer.Strict.WriterT
Warning: Couldn't find .haddock for export Control.Monad.Trans.Writer.Strict.execWriterT
Warning: Couldn't find .haddock for export Control.Monad.Trans.Writer.Strict.mapWriterT
  44% (  8 / 18) in 'Control.Monad.Writer.Strict'
Warning: Couldn't find .haddock for export Control.Monad.Trans.Cont.Cont
Warning: Couldn't find .haddock for export Control.Monad.Trans.Cont.runCont
Warning: Couldn't find .haddock for export Control.Monad.Trans.Cont.mapCont
Warning: Couldn't find .haddock for export Control.Monad.Trans.Cont.withCont
Warning: Couldn't find .haddock for export Control.Monad.Trans.Cont.ContT
Warning: Couldn't find .haddock for export Control.Monad.Trans.Cont.mapContT
Warning: Couldn't find .haddock for export Control.Monad.Trans.Cont.withContT
  60% ( 12 / 20) in 'Control.Monad.Cont'
Warning: Control.Monad.Identity: could not find link destinations for:
    Data.Functor.Identity.Identity
Warning: Control.Monad.Cont.Class: could not find link destinations for:
    Control.Monad.Trans.Identity.IdentityT Control.Monad.Trans.Maybe.MaybeT
Warning: Control.Monad.Error.Class: could not find link destinations for:
    Control.Monad.Trans.Error.ErrorList Control.Monad.Trans.Identity.IdentityT Control.Monad.Trans.Maybe.MaybeT
Warning: Control.Monad.Error: could not find link destinations for:
    Control.Monad.Trans.Identity.IdentityT Control.Monad.Trans.Maybe.MaybeT Control.Monad.Trans.Error.ErrorList Control.Monad.Trans.Class.MonadTrans Control.Monad.IO.Class.MonadIO
Warning: Control.Monad.List: could not find link destinations for:
    Control.Monad.Trans.Class.MonadTrans Control.Monad.IO.Class.MonadIO
Warning: Control.Monad.Reader.Class: could not find link destinations for:
    Control.Monad.Trans.Identity.IdentityT Control.Monad.Trans.Maybe.MaybeT
Warning: Control.Monad.Reader: could not find link destinations for:
    Control.Monad.Trans.Identity.IdentityT Control.Monad.Trans.Maybe.MaybeT Data.Functor.Identity.Identity Control.Monad.Trans.Class.MonadTrans Control.Monad.IO.Class.MonadIO
Warning: Control.Monad.State.Class: could not find link destinations for:
    Control.Monad.Trans.Identity.IdentityT Control.Monad.Trans.Maybe.MaybeT
Warning: Control.Monad.Writer.Class: could not find link destinations for:
    Control.Monad.Trans.Identity.IdentityT Control.Monad.Trans.Maybe.MaybeT
Warning: Control.Monad.RWS.Class: could not find link destinations for:
    Control.Monad.Trans.Identity.IdentityT Control.Monad.Trans.Maybe.MaybeT
Warning: Control.Monad.RWS.Lazy: could not find link destinations for:
    Data.Functor.Identity.Identity Control.Monad.Trans.Class.MonadTrans Control.Monad.IO.Class.MonadIO
Warning: Control.Monad.RWS.Strict: could not find link destinations for:
    Data.Functor.Identity.Identity Control.Monad.Trans.Class.MonadTrans Control.Monad.IO.Class.MonadIO
Warning: Control.Monad.State.Lazy: could not find link destinations for:
    Control.Monad.Trans.Identity.IdentityT Control.Monad.Trans.Maybe.MaybeT Data.Functor.Identity.Identity Control.Monad.Trans.Class.MonadTrans Control.Monad.IO.Class.MonadIO
Warning: Control.Monad.State.Strict: could not find link destinations for:
    Control.Monad.Trans.Identity.IdentityT Control.Monad.Trans.Maybe.MaybeT Data.Functor.Identity.Identity Control.Monad.Trans.Class.MonadTrans Control.Monad.IO.Class.MonadIO
Warning: Control.Monad.Writer.Lazy: could not find link destinations for:
    Control.Monad.Trans.Identity.IdentityT Control.Monad.Trans.Maybe.MaybeT Data.Functor.Identity.Identity Control.Monad.Trans.Class.MonadTrans Control.Monad.IO.Class.MonadIO
Warning: Control.Monad.Writer.Strict: could not find link destinations for:
    Control.Monad.Trans.Identity.IdentityT Control.Monad.Trans.Maybe.MaybeT Data.Functor.Identity.Identity Control.Monad.Trans.Class.MonadTrans Control.Monad.IO.Class.MonadIO
Warning: Control.Monad.Cont: could not find link destinations for:
    Control.Monad.Trans.Identity.IdentityT Control.Monad.Trans.Maybe.MaybeT Data.Functor.Identity.Identity Control.Monad.Trans.Class.MonadTrans Control.Monad.IO.Class.MonadIO
Documentation created: dist/doc/html/monads-tf/index.html
Installing library in
/srv/hackage/var/build/tmp-install/lib/x86_64-linux-ghc-7.6.3/monads-tf-0.1.0.1
Registering monads-tf-0.1.0.1...
Installed monads-tf-0.1.0.1
Configuring nats-0.1.2...
Building nats-0.1.2...
Preprocessing library nats-0.1.2...
[1 of 2] Compiling Numeric.Natural.Internal ( src/Numeric/Natural/Internal.hs, dist/build/Numeric/Natural/Internal.o )
[2 of 2] Compiling Numeric.Natural  ( src/Numeric/Natural.hs, dist/build/Numeric/Natural.o )
In-place registering nats-0.1.2...
Running Haddock for nats-0.1.2...
Running hscolour for nats-0.1.2...
Preprocessing library nats-0.1.2...
Preprocessing library nats-0.1.2...
Haddock coverage:
  75% (  3 /  4) in 'Numeric.Natural.Internal'
  75% (  3 /  4) in 'Numeric.Natural'
Documentation created: dist/doc/html/nats/index.html
Installing library in
/srv/hackage/var/build/tmp-install/lib/x86_64-linux-ghc-7.6.3/nats-0.1.2
Registering nats-0.1.2...
Installed nats-0.1.2
Configuring parallel-3.2.0.4...
Building parallel-3.2.0.4...
Preprocessing library parallel-3.2.0.4...
[1 of 3] Compiling Control.Parallel ( Control/Parallel.hs, dist/build/Control/Parallel.o )
[2 of 3] Compiling Control.Seq      ( Control/Seq.hs, dist/build/Control/Seq.o )
[3 of 3] Compiling Control.Parallel.Strategies ( Control/Parallel/Strategies.hs, dist/build/Control/Parallel/Strategies.o )
In-place registering parallel-3.2.0.4...
Running Haddock for parallel-3.2.0.4...
Running hscolour for parallel-3.2.0.4...
Preprocessing library parallel-3.2.0.4...
Preprocessing library parallel-3.2.0.4...
Haddock coverage:
 100% (  3 /  3) in 'Control.Parallel'
  72% ( 21 / 29) in 'Control.Seq'
  81% ( 68 / 84) in 'Control.Parallel.Strategies'
Documentation created: dist/doc/html/parallel/index.html
Installing library in
/srv/hackage/var/build/tmp-install/lib/x86_64-linux-ghc-7.6.3/parallel-3.2.0.4
Registering parallel-3.2.0.4...
Installed parallel-3.2.0.4
Configuring primitive-0.5.1.0...
Building primitive-0.5.1.0...
Preprocessing library primitive-0.5.1.0...
[ 1 of 10] Compiling Data.Primitive.Internal.Compat ( Data/Primitive/Internal/Compat.hs, dist/build/Data/Primitive/Internal/Compat.o )
[ 2 of 10] Compiling Data.Primitive.MachDeps ( Data/Primitive/MachDeps.hs, dist/build/Data/Primitive/MachDeps.o )
[ 3 of 10] Compiling Data.Primitive.Internal.Operations ( Data/Primitive/Internal/Operations.hs, dist/build/Data/Primitive/Internal/Operations.o )
[ 4 of 10] Compiling Control.Monad.Primitive ( Control/Monad/Primitive.hs, dist/build/Control/Monad/Primitive.o )
[ 5 of 10] Compiling Data.Primitive.Types ( Data/Primitive/Types.hs, dist/build/Data/Primitive/Types.o )
[ 6 of 10] Compiling Data.Primitive.Array ( Data/Primitive/Array.hs, dist/build/Data/Primitive/Array.o )
[ 7 of 10] Compiling Data.Primitive.ByteArray ( Data/Primitive/ByteArray.hs, dist/build/Data/Primitive/ByteArray.o )
[ 8 of 10] Compiling Data.Primitive.Addr ( Data/Primitive/Addr.hs, dist/build/Data/Primitive/Addr.o )
[ 9 of 10] Compiling Data.Primitive   ( Data/Primitive.hs, dist/build/Data/Primitive.o )
[10 of 10] Compiling Data.Primitive.MutVar ( Data/Primitive/MutVar.hs, dist/build/Data/Primitive/MutVar.o )
In-place registering primitive-0.5.1.0...
Running Haddock for primitive-0.5.1.0...
Running hscolour for primitive-0.5.1.0...
Preprocessing library primitive-0.5.1.0...
Preprocessing library primitive-0.5.1.0...
Haddock coverage:
  67% (  2 /  3) in 'Data.Primitive.Internal.Compat'
   3% (  1 / 35) in 'Data.Primitive.MachDeps'
   3% (  1 / 29) in 'Data.Primitive.Internal.Operations'
Warning: Control.Monad.Primitive: We do not support associated types in instances yet. These instances are affected:
Control.Monad.Primitive.PrimMonad GHC.Types.IO, Control.Monad.Primitive.PrimMonad (GHC.ST.ST s)
  71% ( 10 / 14) in 'Control.Monad.Primitive'
 100% (  3 /  3) in 'Data.Primitive.Types'
 100% ( 13 / 13) in 'Data.Primitive.Array'
  93% ( 27 / 29) in 'Data.Primitive.ByteArray'
 100% ( 16 / 16) in 'Data.Primitive.Addr'
 100% (  7 /  7) in 'Data.Primitive'
 100% (  7 /  7) in 'Data.Primitive.MutVar'
Documentation created: dist/doc/html/primitive/index.html
Installing library in
/srv/hackage/var/build/tmp-install/lib/x86_64-linux-ghc-7.6.3/primitive-0.5.1.0
Registering primitive-0.5.1.0...
Installed primitive-0.5.1.0
Configuring split-0.2.2...
Building split-0.2.2...
Preprocessing library split-0.2.2...
[1 of 2] Compiling Data.List.Split.Internals ( src/Data/List/Split/Internals.hs, dist/build/Data/List/Split/Internals.o )
[2 of 2] Compiling Data.List.Split  ( src/Data/List/Split.hs, dist/build/Data/List/Split.o )
In-place registering split-0.2.2...
Running Haddock for split-0.2.2...
Running hscolour for split-0.2.2...
Preprocessing library split-0.2.2...
Preprocessing library split-0.2.2...
Haddock coverage:
  91% ( 61 / 67) in 'Data.List.Split.Internals'
  90% ( 44 / 49) in 'Data.List.Split'
Documentation created: dist/doc/html/split/index.html
Installing library in
/srv/hackage/var/build/tmp-install/lib/x86_64-linux-ghc-7.6.3/split-0.2.2
Registering split-0.2.2...
Installed split-0.2.2
Configuring stm-2.4.2...
Building stm-2.4.2...
Preprocessing library stm-2.4.2...
[ 1 of 10] Compiling Control.Sequential.STM ( Control/Sequential/STM.hs, dist/build/Control/Sequential/STM.o )
[ 2 of 10] Compiling Control.Concurrent.STM.TBQueue ( Control/Concurrent/STM/TBQueue.hs, dist/build/Control/Concurrent/STM/TBQueue.o )
[ 3 of 10] Compiling Control.Concurrent.STM.TQueue ( Control/Concurrent/STM/TQueue.hs, dist/build/Control/Concurrent/STM/TQueue.o )
[ 4 of 10] Compiling Control.Concurrent.STM.TChan ( Control/Concurrent/STM/TChan.hs, dist/build/Control/Concurrent/STM/TChan.o )
[ 5 of 10] Compiling Control.Concurrent.STM.TMVar ( Control/Concurrent/STM/TMVar.hs, dist/build/Control/Concurrent/STM/TMVar.o )
[ 6 of 10] Compiling Control.Concurrent.STM.TVar ( Control/Concurrent/STM/TVar.hs, dist/build/Control/Concurrent/STM/TVar.o )
[ 7 of 10] Compiling Control.Concurrent.STM.TArray ( Control/Concurrent/STM/TArray.hs, dist/build/Control/Concurrent/STM/TArray.o )
[ 8 of 10] Compiling Control.Monad.STM ( Control/Monad/STM.hs, dist/build/Control/Monad/STM.o )
[ 9 of 10] Compiling Control.Concurrent.STM ( Control/Concurrent/STM.hs, dist/build/Control/Concurrent/STM.o )
[10 of 10] Compiling Control.Concurrent.STM.TSem ( Control/Concurrent/STM/TSem.hs, dist/build/Control/Concurrent/STM/TSem.o )
In-place registering stm-2.4.2...
Running Haddock for stm-2.4.2...
Running hscolour for stm-2.4.2...
Preprocessing library stm-2.4.2...
Preprocessing library stm-2.4.2...
Haddock coverage:
   0% (  0 / 11) in 'Control.Sequential.STM'
 100% ( 12 / 12) in 'Control.Concurrent.STM.TBQueue'
 100% ( 12 / 12) in 'Control.Concurrent.STM.TQueue'
 100% ( 18 / 18) in 'Control.Concurrent.STM.TChan'
 100% ( 15 / 15) in 'Control.Concurrent.STM.TMVar'
 100% ( 12 / 12) in 'Control.Concurrent.STM.TVar'
 100% (  2 /  2) in 'Control.Concurrent.STM.TArray'
  90% (  9 / 10) in 'Control.Monad.STM'
 100% (  8 /  8) in 'Control.Concurrent.STM'
  40% (  2 /  5) in 'Control.Concurrent.STM.TSem'
Documentation created: dist/doc/html/stm/index.html
Installing library in
/srv/hackage/var/build/tmp-install/lib/x86_64-linux-ghc-7.6.3/stm-2.4.2
Registering stm-2.4.2...
Installed stm-2.4.2
Configuring tagged-0.7...
Building tagged-0.7...
Preprocessing library tagged-0.7...
[1 of 2] Compiling Data.Proxy       ( old/Data/Proxy.hs, dist/build/Data/Proxy.o )
[2 of 2] Compiling Data.Tagged      ( src/Data/Tagged.hs, dist/build/Data/Tagged.o )
In-place registering tagged-0.7...
Running Haddock for tagged-0.7...
Running hscolour for tagged-0.7...
Preprocessing library tagged-0.7...
Preprocessing library tagged-0.7...
Haddock coverage:
  80% (  4 /  5) in 'Data.Proxy'
  92% ( 11 / 12) in 'Data.Tagged'
Documentation created: dist/doc/html/tagged/index.html
Installing library in
/srv/hackage/var/build/tmp-install/lib/x86_64-linux-ghc-7.6.3/tagged-0.7
Registering tagged-0.7...
Installed tagged-0.7
Configuring transformers-base-0.4.1...
Building transformers-base-0.4.1...
Preprocessing library transformers-base-0.4.1...
[1 of 1] Compiling Control.Monad.Base ( src/Control/Monad/Base.hs, dist/build/Control/Monad/Base.o )
In-place registering transformers-base-0.4.1...
Running Haddock for transformers-base-0.4.1...
Running hscolour for transformers-base-0.4.1...
Preprocessing library transformers-base-0.4.1...
Preprocessing library transformers-base-0.4.1...
Warning: The documentation for the following packages are not installed. No
links will be generated to these packages: transformers-0.3.0.0
Haddock coverage:
  33% (  1 /  3) in 'Control.Monad.Base'
Warning: Control.Monad.Base: could not find link destinations for:
    Data.Functor.Identity.Identity Control.Monad.Trans.List.ListT Control.Monad.Trans.Maybe.MaybeT Control.Monad.Trans.Identity.IdentityT Control.Monad.Trans.Error.Error Control.Monad.Trans.Error.ErrorT Control.Monad.Trans.Writer.Strict.WriterT Control.Monad.Trans.Writer.Lazy.WriterT Control.Monad.Trans.Cont.ContT Control.Monad.Trans.State.Strict.StateT Control.Monad.Trans.State.Lazy.StateT Control.Monad.Trans.Reader.ReaderT Control.Monad.Trans.RWS.Strict.RWST Control.Monad.Trans.RWS.Lazy.RWST Control.Monad.Trans.Class.MonadTrans Control.Monad.Trans.Class.lift
Documentation created: dist/doc/html/transformers-base/index.html
Installing library in
/srv/hackage/var/build/tmp-install/lib/x86_64-linux-ghc-7.6.3/transformers-base-0.4.1
Registering transformers-base-0.4.1...
Installed transformers-base-0.4.1
Configuring transformers-compat-0.1.1.1...
Building transformers-compat-0.1.1.1...
Preprocessing library transformers-compat-0.1.1.1...
[1 of 1] Compiling Paths_transformers_compat ( dist/build/autogen/Paths_transformers_compat.hs, dist/build/Paths_transformers_compat.o )
In-place registering transformers-compat-0.1.1.1...
Running Haddock for transformers-compat-0.1.1.1...
Running hscolour for transformers-compat-0.1.1.1...
Preprocessing library transformers-compat-0.1.1.1...
Preprocessing library transformers-compat-0.1.1.1...
Warning: The documentation for the following packages are not installed. No
links will be generated to these packages: transformers-0.3.0.0
Haddock coverage:
   0% (  0 /  8) in 'Paths_transformers_compat'
Documentation created: dist/doc/html/transformers-compat/index.html
Installing library in
/srv/hackage/var/build/tmp-install/lib/x86_64-linux-ghc-7.6.3/transformers-compat-0.1.1.1
Registering transformers-compat-0.1.1.1...
Installed transformers-compat-0.1.1.1
Configuring utf8-string-0.3.7...
Building utf8-string-0.3.7...
Preprocessing library utf8-string-0.3.7...
[1 of 7] Compiling Codec.Binary.UTF8.String ( Codec/Binary/UTF8/String.hs, dist/build/Codec/Binary/UTF8/String.o )
[2 of 7] Compiling Codec.Binary.UTF8.Generic ( Codec/Binary/UTF8/Generic.hs, dist/build/Codec/Binary/UTF8/Generic.o )
[3 of 7] Compiling Data.String.UTF8 ( Data/String/UTF8.hs, dist/build/Data/String/UTF8.o )
[4 of 7] Compiling System.IO.UTF8   ( System/IO/UTF8.hs, dist/build/System/IO/UTF8.o )
[5 of 7] Compiling System.Environment.UTF8 ( System/Environment/UTF8.hs, dist/build/System/Environment/UTF8.o )
[6 of 7] Compiling Data.ByteString.UTF8 ( Data/ByteString/UTF8.hs, dist/build/Data/ByteString/UTF8.o )
[7 of 7] Compiling Data.ByteString.Lazy.UTF8 ( Data/ByteString/Lazy/UTF8.hs, dist/build/Data/ByteString/Lazy/UTF8.o )
In-place registering utf8-string-0.3.7...
Running Haddock for utf8-string-0.3.7...
Running hscolour for utf8-string-0.3.7...
Preprocessing library utf8-string-0.3.7...
Preprocessing library utf8-string-0.3.7...
Haddock coverage:
 100% (  8 /  8) in 'Codec.Binary.UTF8.String'
  94% ( 16 / 17) in 'Codec.Binary.UTF8.Generic'
  89% ( 24 / 27) in 'Data.String.UTF8'
  82% ( 14 / 17) in 'System.IO.UTF8'
  14% (  1 /  7) in 'System.Environment.UTF8'
 100% ( 17 / 17) in 'Data.ByteString.UTF8'
 100% ( 17 / 17) in 'Data.ByteString.Lazy.UTF8'
Documentation created: dist/doc/html/utf8-string/index.html
Installing library in
/srv/hackage/var/build/tmp-install/lib/x86_64-linux-ghc-7.6.3/utf8-string-0.3.7
Registering utf8-string-0.3.7...
Installed utf8-string-0.3.7
Configuring xdg-basedir-0.2.2...
Building xdg-basedir-0.2.2...
Preprocessing library xdg-basedir-0.2.2...
[1 of 1] Compiling System.Environment.XDG.BaseDir ( System/Environment/XDG/BaseDir.hs, dist/build/System/Environment/XDG/BaseDir.o )
In-place registering xdg-basedir-0.2.2...
Running Haddock for xdg-basedir-0.2.2...
Running hscolour for xdg-basedir-0.2.2...
Preprocessing library xdg-basedir-0.2.2...
Preprocessing library xdg-basedir-0.2.2...
Haddock coverage:
  93% ( 14 / 15) in 'System.Environment.XDG.BaseDir'
Documentation created: dist/doc/html/xdg-basedir/index.html
Installing library in
/srv/hackage/var/build/tmp-install/lib/x86_64-linux-ghc-7.6.3/xdg-basedir-0.2.2
Registering xdg-basedir-0.2.2...
Installed xdg-basedir-0.2.2
Configuring data-default-instances-base-0.0.1...
Building data-default-instances-base-0.0.1...
Preprocessing library data-default-instances-base-0.0.1...
[1 of 1] Compiling Data.Default.Instances.Base ( Data/Default/Instances/Base.hs, dist/build/Data/Default/Instances/Base.o )
In-place registering data-default-instances-base-0.0.1...
Running Haddock for data-default-instances-base-0.0.1...
Running hscolour for data-default-instances-base-0.0.1...
Preprocessing library data-default-instances-base-0.0.1...
Preprocessing library data-default-instances-base-0.0.1...
Haddock coverage:
  50% (  1 /  2) in 'Data.Default.Instances.Base'
Documentation created: dist/doc/html/data-default-instances-base/index.html
Installing library in
/srv/hackage/var/build/tmp-install/lib/x86_64-linux-ghc-7.6.3/data-default-instances-base-0.0.1
Registering data-default-instances-base-0.0.1...
Installed data-default-instances-base-0.0.1
Configuring data-default-instances-containers-0.0.1...
Building data-default-instances-containers-0.0.1...
Preprocessing library data-default-instances-containers-0.0.1...
[1 of 1] Compiling Data.Default.Instances.Containers ( Data/Default/Instances/Containers.hs, dist/build/Data/Default/Instances/Containers.o )
In-place registering data-default-instances-containers-0.0.1...
Running Haddock for data-default-instances-containers-0.0.1...
Running hscolour for data-default-instances-containers-0.0.1...
Preprocessing library data-default-instances-containers-0.0.1...
Preprocessing library data-default-instances-containers-0.0.1...
Haddock coverage:
  50% (  1 /  2) in 'Data.Default.Instances.Containers'
Documentation created:
dist/doc/html/data-default-instances-containers/index.html
Installing library in
/srv/hackage/var/build/tmp-install/lib/x86_64-linux-ghc-7.6.3/data-default-instances-containers-0.0.1
Registering data-default-instances-containers-0.0.1...
Installed data-default-instances-containers-0.0.1
Configuring data-default-instances-old-locale-0.0.1...
Building data-default-instances-old-locale-0.0.1...
Preprocessing library data-default-instances-old-locale-0.0.1...
[1 of 1] Compiling Data.Default.Instances.OldLocale ( Data/Default/Instances/OldLocale.hs, dist/build/Data/Default/Instances/OldLocale.o )
In-place registering data-default-instances-old-locale-0.0.1...
Running Haddock for data-default-instances-old-locale-0.0.1...
Running hscolour for data-default-instances-old-locale-0.0.1...
Preprocessing library data-default-instances-old-locale-0.0.1...
Preprocessing library data-default-instances-old-locale-0.0.1...
Haddock coverage:
  50% (  1 /  2) in 'Data.Default.Instances.OldLocale'
Documentation created:
dist/doc/html/data-default-instances-old-locale/index.html
Installing library in
/srv/hackage/var/build/tmp-install/lib/x86_64-linux-ghc-7.6.3/data-default-instances-old-locale-0.0.1
Registering data-default-instances-old-locale-0.0.1...
Installed data-default-instances-old-locale-0.0.1
Configuring data-default-instances-dlist-0.0.1...
Building data-default-instances-dlist-0.0.1...
Preprocessing library data-default-instances-dlist-0.0.1...
[1 of 1] Compiling Data.Default.Instances.DList ( Data/Default/Instances/DList.hs, dist/build/Data/Default/Instances/DList.o )
In-place registering data-default-instances-dlist-0.0.1...
Running Haddock for data-default-instances-dlist-0.0.1...
Running hscolour for data-default-instances-dlist-0.0.1...
Preprocessing library data-default-instances-dlist-0.0.1...
Preprocessing library data-default-instances-dlist-0.0.1...
Haddock coverage:
  50% (  1 /  2) in 'Data.Default.Instances.DList'
Documentation created: dist/doc/html/data-default-instances-dlist/index.html
Installing library in
/srv/hackage/var/build/tmp-install/lib/x86_64-linux-ghc-7.6.3/data-default-instances-dlist-0.0.1
Registering data-default-instances-dlist-0.0.1...
Installed data-default-instances-dlist-0.0.1
Configuring unordered-containers-0.2.3.3...
Building unordered-containers-0.2.3.3...
Preprocessing library unordered-containers-0.2.3.3...
[1 of 8] Compiling Data.HashMap.UnsafeShift ( Data/HashMap/UnsafeShift.hs, dist/build/Data/HashMap/UnsafeShift.o )
[2 of 8] Compiling Data.HashMap.PopCount ( Data/HashMap/PopCount.hs, dist/build/Data/HashMap/PopCount.o )
[3 of 8] Compiling Data.HashMap.Unsafe ( Data/HashMap/Unsafe.hs, dist/build/Data/HashMap/Unsafe.o )
[4 of 8] Compiling Data.HashMap.Array ( Data/HashMap/Array.hs, dist/build/Data/HashMap/Array.o )
[5 of 8] Compiling Data.HashMap.Base ( Data/HashMap/Base.hs, dist/build/Data/HashMap/Base.o )
[6 of 8] Compiling Data.HashMap.Strict ( Data/HashMap/Strict.hs, dist/build/Data/HashMap/Strict.o )
[7 of 8] Compiling Data.HashMap.Lazy ( Data/HashMap/Lazy.hs, dist/build/Data/HashMap/Lazy.o )
[8 of 8] Compiling Data.HashSet     ( Data/HashSet.hs, dist/build/Data/HashSet.o )
In-place registering unordered-containers-0.2.3.3...
Running Haddock for unordered-containers-0.2.3.3...
Running hscolour for unordered-containers-0.2.3.3...
Preprocessing library unordered-containers-0.2.3.3...
Preprocessing library unordered-containers-0.2.3.3...
Warning: The documentation for the following packages are not installed. No
links will be generated to these packages: text-0.11.2.3
Haddock coverage:
   0% (  0 /  3) in 'Data.HashMap.UnsafeShift'
  50% (  1 /  2) in 'Data.HashMap.PopCount'
 100% (  2 /  2) in 'Data.HashMap.Unsafe'
  38% ( 14 / 37) in 'Data.HashMap.Array'
  85% ( 52 / 61) in 'Data.HashMap.Base'
  98% ( 44 / 45) in 'Data.HashMap.Strict'
  98% ( 44 / 45) in 'Data.HashMap.Lazy'
 100% ( 27 / 27) in 'Data.HashSet'
Documentation created: dist/doc/html/unordered-containers/index.html
Installing library in
/srv/hackage/var/build/tmp-install/lib/x86_64-linux-ghc-7.6.3/unordered-containers-0.2.3.3
Registering unordered-containers-0.2.3.3...
Installed unordered-containers-0.2.3.3
Configuring MonadCatchIO-transformers-0.3.1.0...
Building MonadCatchIO-transformers-0.3.1.0...
Preprocessing library MonadCatchIO-transformers-0.3.1.0...
[1 of 2] Compiling Control.Monad.CatchIO ( src/Control/Monad/CatchIO.hs, dist/build/Control/Monad/CatchIO.o )

src/Control/Monad/CatchIO.hs:29:1: Warning:
    Module `Prelude' does not export `catch'
[2 of 2] Compiling Control.Monad.CatchIO.Try ( src/Control/Monad/CatchIO/Try.hs, dist/build/Control/Monad/CatchIO/Try.o )
In-place registering MonadCatchIO-transformers-0.3.1.0...
Running Haddock for MonadCatchIO-transformers-0.3.1.0...
Running hscolour for MonadCatchIO-transformers-0.3.1.0...
Preprocessing library MonadCatchIO-transformers-0.3.1.0...
Preprocessing library MonadCatchIO-transformers-0.3.1.0...
Warning: The documentation for the following packages are not installed. No
links will be generated to these packages: transformers-0.3.0.0

dist/build/tmp-29618/src/Control/Monad/CatchIO.hs:29:1: Warning:
    Module `Prelude' does not export `catch'
Haddock coverage:
  93% ( 13 / 14) in 'Control.Monad.CatchIO'
   0% (  0 /  3) in 'Control.Monad.CatchIO.Try'
Warning: Control.Monad.CatchIO: could not find link destinations for:
    Control.Monad.IO.Class.MonadIO Control.Monad.Trans.Identity.IdentityT Control.Monad.Trans.Maybe.MaybeT
Documentation created: dist/doc/html/MonadCatchIO-transformers/index.html
Installing library in
/srv/hackage/var/build/tmp-install/lib/x86_64-linux-ghc-7.6.3/MonadCatchIO-transformers-0.3.1.0
Registering MonadCatchIO-transformers-0.3.1.0...
Installed MonadCatchIO-transformers-0.3.1.0
Configuring vector-0.10.9.1...
Building vector-0.10.9.1...
Preprocessing library vector-0.10.9.1...
[ 1 of 19] Compiling Data.Vector.Storable.Internal ( Data/Vector/Storable/Internal.hs, dist/build/Data/Vector/Storable/Internal.o )
[ 2 of 19] Compiling Data.Vector.Fusion.Util ( Data/Vector/Fusion/Util.hs, dist/build/Data/Vector/Fusion/Util.o )
[ 3 of 19] Compiling Data.Vector.Fusion.Stream.Size ( Data/Vector/Fusion/Stream/Size.hs, dist/build/Data/Vector/Fusion/Stream/Size.o )

Data/Vector/Fusion/Stream/Size.hs:25:10: Warning:
    No explicit method or default declaration for `*'
    In the instance declaration for `Num Size'

Data/Vector/Fusion/Stream/Size.hs:25:10: Warning:
    No explicit method or default declaration for `abs'
    In the instance declaration for `Num Size'

Data/Vector/Fusion/Stream/Size.hs:25:10: Warning:
    No explicit method or default declaration for `signum'
    In the instance declaration for `Num Size'
[ 4 of 19] Compiling Data.Vector.Internal.Check ( Data/Vector/Internal/Check.hs, dist/build/Data/Vector/Internal/Check.o )
[ 5 of 19] Compiling Data.Vector.Fusion.Stream.Monadic ( Data/Vector/Fusion/Stream/Monadic.hs, dist/build/Data/Vector/Fusion/Stream/Monadic.o )
Loading package ghc-prim ... linking ... done.
Loading package integer-gmp ... linking ... done.
Loading package base ... linking ... done.
Loading package primitive-0.5.1.0 ... linking ... done.
Loading package array-0.4.0.1 ... linking ... done.
Loading package deepseq-1.3.0.1 ... linking ... done.
[ 6 of 19] Compiling Data.Vector.Fusion.Stream ( Data/Vector/Fusion/Stream.hs, dist/build/Data/Vector/Fusion/Stream.o )
[ 7 of 19] Compiling Data.Vector.Generic.Mutable ( Data/Vector/Generic/Mutable.hs, dist/build/Data/Vector/Generic/Mutable.o )
[ 8 of 19] Compiling Data.Vector.Generic.Base ( Data/Vector/Generic/Base.hs, dist/build/Data/Vector/Generic/Base.o )
[ 9 of 19] Compiling Data.Vector.Generic.New ( Data/Vector/Generic/New.hs, dist/build/Data/Vector/Generic/New.o )
[10 of 19] Compiling Data.Vector.Generic ( Data/Vector/Generic.hs, dist/build/Data/Vector/Generic.o )
[11 of 19] Compiling Data.Vector.Primitive.Mutable ( Data/Vector/Primitive/Mutable.hs, dist/build/Data/Vector/Primitive/Mutable.o )
[12 of 19] Compiling Data.Vector.Primitive ( Data/Vector/Primitive.hs, dist/build/Data/Vector/Primitive.o )
[13 of 19] Compiling Data.Vector.Storable.Mutable ( Data/Vector/Storable/Mutable.hs, dist/build/Data/Vector/Storable/Mutable.o )
[14 of 19] Compiling Data.Vector.Storable ( Data/Vector/Storable.hs, dist/build/Data/Vector/Storable.o )
[15 of 19] Compiling Data.Vector.Unboxed.Base ( Data/Vector/Unboxed/Base.hs, dist/build/Data/Vector/Unboxed/Base.o )
[16 of 19] Compiling Data.Vector.Unboxed ( Data/Vector/Unboxed.hs, dist/build/Data/Vector/Unboxed.o )
[17 of 19] Compiling Data.Vector.Unboxed.Mutable ( Data/Vector/Unboxed/Mutable.hs, dist/build/Data/Vector/Unboxed/Mutable.o )
[18 of 19] Compiling Data.Vector.Mutable ( Data/Vector/Mutable.hs, dist/build/Data/Vector/Mutable.o )
[19 of 19] Compiling Data.Vector      ( Data/Vector.hs, dist/build/Data/Vector.o )
In-place registering vector-0.10.9.1...
Running Haddock for vector-0.10.9.1...
Running hscolour for vector-0.10.9.1...
Preprocessing library vector-0.10.9.1...
Preprocessing library vector-0.10.9.1...

Data/Vector/Fusion/Stream/Size.hs:25:10: Warning:
    No explicit method or default declaration for `*'
    In the instance declaration for `Num Size'

Data/Vector/Fusion/Stream/Size.hs:25:10: Warning:
    No explicit method or default declaration for `abs'
    In the instance declaration for `Num Size'

Data/Vector/Fusion/Stream/Size.hs:25:10: Warning:
    No explicit method or default declaration for `signum'
    In the instance declaration for `Num Size'
Haddock coverage:
  25% (  1 /  4) in 'Data.Vector.Storable.Internal'
 100% (  5 /  5) in 'Data.Vector.Fusion.Util'
 100% (  6 /  6) in 'Data.Vector.Fusion.Stream.Size'
  11% (  1 /  9) in 'Data.Vector.Internal.Check'
  83% (104 /126) in 'Data.Vector.Fusion.Stream.Monadic'
  85% ( 88 /104) in 'Data.Vector.Fusion.Stream'
  64% ( 42 / 66) in 'Data.Vector.Generic.Mutable'
 100% (  3 /  3) in 'Data.Vector.Generic.Base'
   5% (  1 / 20) in 'Data.Vector.Generic.New'
  93% (215 /232) in 'Data.Vector.Generic'
  76% ( 38 / 50) in 'Data.Vector.Primitive.Mutable'
Warning: Data.Vector.Primitive: Instances of type and data families are not yet supported. Instances of the following families will be filtered out:
  Mutable
  97% (185 /191) in 'Data.Vector.Primitive'
  79% ( 46 / 58) in 'Data.Vector.Storable.Mutable'
Warning: Data.Vector.Storable: Instances of type and data families are not yet supported. Instances of the following families will be filtered out:
  Mutable
  97% (194 /200) in 'Data.Vector.Storable'
Warning: Data.Vector.Unboxed.Base: Instances of type and data families are not yet supported. Instances of the following families will be filtered out:
  Mutable, MVector, Vector
  17% (  1 /  6) in 'Data.Vector.Unboxed.Base'
  96% (201 /210) in 'Data.Vector.Unboxed'
  77% ( 47 / 61) in 'Data.Vector.Unboxed.Mutable'
  76% ( 37 / 49) in 'Data.Vector.Mutable'
Warning: Data.Vector: Instances of type and data families are not yet supported. Instances of the following families will be filtered out:
  Mutable
  94% (199 /212) in 'Data.Vector'
Documentation created: dist/doc/html/vector/index.html
Installing library in
/srv/hackage/var/build/tmp-install/lib/x86_64-linux-ghc-7.6.3/vector-0.10.9.1
Registering vector-0.10.9.1...
Installed vector-0.10.9.1
Configuring async-2.0.1.4...
Building async-2.0.1.4...
Preprocessing library async-2.0.1.4...
[1 of 1] Compiling Control.Concurrent.Async ( Control/Concurrent/Async.hs, dist/build/Control/Concurrent/Async.o )
In-place registering async-2.0.1.4...
Running Haddock for async-2.0.1.4...
Running hscolour for async-2.0.1.4...
Preprocessing library async-2.0.1.4...
Preprocessing library async-2.0.1.4...
Haddock coverage:
 100% ( 46 / 46) in 'Control.Concurrent.Async'
Documentation created: dist/doc/html/async/index.html
Installing library in
/srv/hackage/var/build/tmp-install/lib/x86_64-linux-ghc-7.6.3/async-2.0.1.4
Registering async-2.0.1.4...
Installed async-2.0.1.4
Configuring reflection-1.3.2...
Building reflection-1.3.2...
Preprocessing library reflection-1.3.2...
[1 of 1] Compiling Data.Reflection  ( fast/Data/Reflection.hs, dist/build/Data/Reflection.o )
In-place registering reflection-1.3.2...
Running Haddock for reflection-1.3.2...
Running hscolour for reflection-1.3.2...
Preprocessing library reflection-1.3.2...
Preprocessing library reflection-1.3.2...
Haddock coverage:
  67% ( 10 / 15) in 'Data.Reflection'
Documentation created: dist/doc/html/reflection/index.html
Installing library in
/srv/hackage/var/build/tmp-install/lib/x86_64-linux-ghc-7.6.3/reflection-1.3.2
Registering reflection-1.3.2...
Installed reflection-1.3.2
Configuring monad-control-0.3.2.2...
Building monad-control-0.3.2.2...
Preprocessing library monad-control-0.3.2.2...
[1 of 1] Compiling Control.Monad.Trans.Control ( Control/Monad/Trans/Control.hs, dist/build/Control/Monad/Trans/Control.o )
In-place registering monad-control-0.3.2.2...
Running Haddock for monad-control-0.3.2.2...
Running hscolour for monad-control-0.3.2.2...
Preprocessing library monad-control-0.3.2.2...
Preprocessing library monad-control-0.3.2.2...
Warning: The documentation for the following packages are not installed. No
links will be generated to these packages: transformers-0.3.0.0
Haddock coverage:
Warning: Control.Monad.Trans.Control: We do not support associated types in instances yet. These instances are affected:
Control.Monad.Trans.Control.MonadTransControl Control.Monad.Trans.Identity.IdentityT, Control.Monad.Trans.Control.MonadTransControl Control.Monad.Trans.Maybe.MaybeT, Control.Monad.Trans.Error.Error e =>
Control.Monad.Trans.Control.MonadTransControl (Control.Monad.Trans.Error.ErrorT e), Control.Monad.Trans.Control.MonadTransControl Control.Monad.Trans.List.ListT, Control.Monad.Trans.Control.MonadTransControl (Control.Monad.Trans.Reader.ReaderT r), Control.Monad.Trans.Control.MonadTransControl (Control.Monad.Trans.State.Lazy.StateT s), Control.Monad.Trans.Control.MonadTransControl (Control.Monad.Trans.State.Strict.StateT s), Data.Monoid.Monoid w =>
Control.Monad.Trans.Control.MonadTransControl (Control.Monad.Trans.Writer.Lazy.WriterT w), Data.Monoid.Monoid w =>
Control.Monad.Trans.Control.MonadTransControl (Control.Monad.Trans.Writer.Strict.WriterT w), Data.Monoid.Monoid w =>
Control.Monad.Trans.Control.MonadTransControl (Control.Monad.Trans.RWS.Lazy.RWST r w s), Data.Monoid.Monoid w =>
Control.Monad.Trans.Control.MonadTransControl (Control.Monad.Trans.RWS.Strict.RWST r w s), Control.Monad.Trans.Control.MonadBaseControl (GHC.Types.IO) (GHC.Types.IO), Control.Monad.Trans.Control.MonadBaseControl (Data.Maybe.Maybe) (Data.Maybe.Maybe), Control.Monad.Trans.Control.MonadBaseControl (Data.Either.Either e) (Data.Either.Either e), Control.Monad.Trans.Control.MonadBaseControl ([]) ([]), Control.Monad.Trans.Control.MonadBaseControl ((->) r) ((->) r), Control.Monad.Trans.Control.MonadBaseControl (Data.Functor.Identity.Identity) (Data.Functor.Identity.Identity), Control.Monad.Trans.Control.MonadBaseControl (GHC.Conc.Sync.STM) (GHC.Conc.Sync.STM), Control.Monad.Trans.Control.MonadBaseControl (GHC.ST.ST s) (GHC.ST.ST s), Control.Monad.Trans.Control.MonadBaseControl (Control.Monad.ST.Lazy.Imp.ST s) (Control.Monad.ST.Lazy.Imp.ST s), Control.Monad.Trans.Control.MonadBaseControl b m =>
Control.Monad.Trans.Control.MonadBaseControl b (Control.Monad.Trans.Identity.IdentityT m), Control.Monad.Trans.Control.MonadBaseControl b m =>
Control.Monad.Trans.Control.MonadBaseControl b (Control.Monad.Trans.Maybe.MaybeT m), Control.Monad.Trans.Control.MonadBaseControl b m =>
Control.Monad.Trans.Control.MonadBaseControl b (Control.Monad.Trans.List.ListT m), Control.Monad.Trans.Control.MonadBaseControl b m =>
Control.Monad.Trans.Control.MonadBaseControl b (Control.Monad.Trans.Reader.ReaderT r m), Control.Monad.Trans.Control.MonadBaseControl b m =>
Control.Monad.Trans.Control.MonadBaseControl b (Control.Monad.Trans.State.Strict.StateT s m), Control.Monad.Trans.Control.MonadBaseControl b m =>
Control.Monad.Trans.Control.MonadBaseControl b (Control.Monad.Trans.State.Lazy.StateT s m), (Control.Monad.Trans.Error.Error e,
 Control.Monad.Trans.Control.MonadBaseControl b m) =>
Control.Monad.Trans.Control.MonadBaseControl b (Control.Monad.Trans.Error.ErrorT e m), (Data.Monoid.Monoid w,
 Control.Monad.Trans.Control.MonadBaseControl b m) =>
Control.Monad.Trans.Control.MonadBaseControl b (Control.Monad.Trans.Writer.Strict.WriterT w m), (Data.Monoid.Monoid w,
 Control.Monad.Trans.Control.MonadBaseControl b m) =>
Control.Monad.Trans.Control.MonadBaseControl b (Control.Monad.Trans.Writer.Lazy.WriterT w m), (Data.Monoid.Monoid w,
 Control.Monad.Trans.Control.MonadBaseControl b m) =>
Control.Monad.Trans.Control.MonadBaseControl b (Control.Monad.Trans.RWS.Strict.RWST r w s m), (Data.Monoid.Monoid w,
 Control.Monad.Trans.Control.MonadBaseControl b m) =>
Control.Monad.Trans.Control.MonadBaseControl b (Control.Monad.Trans.RWS.Lazy.RWST r w s m)
  86% ( 18 / 21) in 'Control.Monad.Trans.Control'
Warning: Control.Monad.Trans.Control: could not find link destinations for:
    Control.Monad.Trans.Class.MonadTrans Control.Monad.Trans.Identity.IdentityT Control.Monad.Trans.List.ListT Control.Monad.Trans.Maybe.MaybeT Control.Monad.Trans.Error.Error Control.Monad.Trans.Error.ErrorT Control.Monad.Trans.Reader.ReaderT Control.Monad.Trans.State.Lazy.StateT Control.Monad.Trans.Writer.Lazy.WriterT Control.Monad.Trans.State.Strict.StateT Control.Monad.Trans.Writer.Strict.WriterT Control.Monad.Trans.RWS.Lazy.RWST Control.Monad.Trans.RWS.Strict.RWST Data.Functor.Identity.Identity
Documentation created: dist/doc/html/monad-control/index.html
Installing library in
/srv/hackage/var/build/tmp-install/lib/x86_64-linux-ghc-7.6.3/monad-control-0.3.2.2
Registering monad-control-0.3.2.2...
Installed monad-control-0.3.2.2
Configuring contravariant-0.4.4...
Building contravariant-0.4.4...
Preprocessing library contravariant-0.4.4...
[1 of 3] Compiling Data.Functor.Contravariant ( Data/Functor/Contravariant.hs, dist/build/Data/Functor/Contravariant.o )
[2 of 3] Compiling Data.Functor.Contravariant.Compose ( Data/Functor/Contravariant/Compose.hs, dist/build/Data/Functor/Contravariant/Compose.o )
[3 of 3] Compiling Data.Functor.Contravariant.Day ( Data/Functor/Contravariant/Day.hs, dist/build/Data/Functor/Contravariant/Day.o )
In-place registering contravariant-0.4.4...
Running Haddock for contravariant-0.4.4...
Running hscolour for contravariant-0.4.4...
Preprocessing library contravariant-0.4.4...
Preprocessing library contravariant-0.4.4...
Warning: The documentation for the following packages are not installed. No
links will be generated to these packages: transformers-0.3.0.0
Haddock coverage:
  81% ( 13 / 16) in 'Data.Functor.Contravariant'
 100% (  4 /  4) in 'Data.Functor.Contravariant.Compose'
 100% ( 14 / 14) in 'Data.Functor.Contravariant.Day'
Warning: Data.Functor.Contravariant: could not find link destinations for:
    Control.Applicative.Backwards.Backwards Data.Functor.Constant.Constant Data.Functor.Reverse.Reverse Data.Functor.Product.Product Data.Functor.Compose.Compose
Documentation created: dist/doc/html/contravariant/index.html
Installing library in
/srv/hackage/var/build/tmp-install/lib/x86_64-linux-ghc-7.6.3/contravariant-0.4.4
Registering contravariant-0.4.4...
Installed contravariant-0.4.4
[1 of 1] Compiling Main             ( /tmp/distributive-0.3.2-29618/distributive-0.3.2/Setup.lhs, /tmp/distributive-0.3.2-29618/distributive-0.3.2/dist/setup/Main.o )
Linking /tmp/distributive-0.3.2-29618/distributive-0.3.2/dist/setup/setup ...
Configuring distributive-0.3.2...
Building distributive-0.3.2...
Preprocessing library distributive-0.3.2...
[1 of 1] Compiling Data.Distributive ( src/Data/Distributive.hs, dist/build/Data/Distributive.o )
In-place registering distributive-0.3.2...
Running Haddock for distributive-0.3.2...
Running hscolour for distributive-0.3.2...
Preprocessing library distributive-0.3.2...
Preprocessing library distributive-0.3.2...
Warning: The documentation for the following packages are not installed. No
links will be generated to these packages: rts-1.0, transformers-0.3.0.0
Haddock coverage:
 100% (  4 /  4) in 'Data.Distributive'
Warning: Data.Distributive: could not find link destinations for:
    Data.Functor.Identity.Identity Control.Applicative.Backwards.Backwards Control.Monad.Trans.Identity.IdentityT Data.Functor.Reverse.Reverse Control.Monad.Trans.Reader.ReaderT Data.Functor.Compose.Compose Data.Functor.Product.Product
Documentation created: dist/doc/html/distributive/index.html
Installing library in
/srv/hackage/var/build/tmp-install/lib/x86_64-linux-ghc-7.6.3/distributive-0.3.2
Registering distributive-0.3.2...
Installed distributive-0.3.2
[1 of 2] Compiling SetupWrapper     ( /tmp/cairo-0.12.5.0-29618/cairo-0.12.5.0/SetupWrapper.hs, /tmp/cairo-0.12.5.0-29618/cairo-0.12.5.0/dist/setup/SetupWrapper.o )
[2 of 2] Compiling Main             ( /tmp/cairo-0.12.5.0-29618/cairo-0.12.5.0/Setup.hs, /tmp/cairo-0.12.5.0-29618/cairo-0.12.5.0/dist/setup/Main.o )
Linking /tmp/cairo-0.12.5.0-29618/cairo-0.12.5.0/dist/setup/setup ...
[1 of 2] Compiling Gtk2HsSetup      ( Gtk2HsSetup.hs, dist/setup-wrapper/Gtk2HsSetup.o )
[2 of 2] Compiling Main             ( SetupMain.hs, dist/setup-wrapper/Main.o )
Linking dist/setup-wrapper/setup ...
Configuring cairo-0.12.5.0...
setup: The program gtk2hsC2hs version >=0.13.8 is required but the version
found at /srv/hackage/var/build/bin/gtk2hsC2hs is version 0.13.6
Failed to install cairo-0.12.5.0
[1 of 2] Compiling SetupWrapper     ( /tmp/glib-0.12.5.0-29618/glib-0.12.5.0/SetupWrapper.hs, /tmp/glib-0.12.5.0-29618/glib-0.12.5.0/dist/setup/SetupWrapper.o )
[2 of 2] Compiling Main             ( /tmp/glib-0.12.5.0-29618/glib-0.12.5.0/Setup.hs, /tmp/glib-0.12.5.0-29618/glib-0.12.5.0/dist/setup/Main.o )
Linking /tmp/glib-0.12.5.0-29618/glib-0.12.5.0/dist/setup/setup ...
[1 of 2] Compiling Gtk2HsSetup      ( Gtk2HsSetup.hs, dist/setup-wrapper/Gtk2HsSetup.o )
[2 of 2] Compiling Main             ( SetupMain.hs, dist/setup-wrapper/Main.o )
Linking dist/setup-wrapper/setup ...
Configuring glib-0.12.5.0...
setup: The program gtk2hsC2hs version >=0.13.8 is required but the version
found at /srv/hackage/var/build/bin/gtk2hsC2hs is version 0.13.6
Failed to install glib-0.12.5.0
Configuring dyre-0.8.11...
Building dyre-0.8.11...
Preprocessing library dyre-0.8.11...
[1 of 7] Compiling Config.Dyre.Params ( Config/Dyre/Params.hs, dist/build/Config/Dyre/Params.o )
[2 of 7] Compiling Config.Dyre.Options ( Config/Dyre/Options.hs, dist/build/Config/Dyre/Options.o )
[3 of 7] Compiling Config.Dyre.Compat ( Config/Dyre/Compat.hs, dist/build/Config/Dyre/Compat.o )
[4 of 7] Compiling Config.Dyre.Relaunch ( Config/Dyre/Relaunch.hs, dist/build/Config/Dyre/Relaunch.o )
[5 of 7] Compiling Config.Dyre.Paths ( Config/Dyre/Paths.hs, dist/build/Config/Dyre/Paths.o )
[6 of 7] Compiling Config.Dyre.Compile ( Config/Dyre/Compile.hs, dist/build/Config/Dyre/Compile.o )
[7 of 7] Compiling Config.Dyre      ( Config/Dyre.hs, dist/build/Config/Dyre.o )
In-place registering dyre-0.8.11...
Running Haddock for dyre-0.8.11...
Running hscolour for dyre-0.8.11...
Preprocessing library dyre-0.8.11...
Preprocessing library dyre-0.8.11...
Haddock coverage:
  67% (  2 /  3) in 'Config.Dyre.Params'
  89% (  8 /  9) in 'Config.Dyre.Options'
 100% (  3 /  3) in 'Config.Dyre.Compat'
  88% (  7 /  8) in 'Config.Dyre.Relaunch'
  67% (  2 /  3) in 'Config.Dyre.Paths'
 100% (  4 /  4) in 'Config.Dyre.Compile'
 100% (  4 /  4) in 'Config.Dyre'
Documentation created: dist/doc/html/dyre/index.html
Installing library in
/srv/hackage/var/build/tmp-install/lib/x86_64-linux-ghc-7.6.3/dyre-0.8.11
Registering dyre-0.8.11...
Installed dyre-0.8.11
Configuring data-default-0.5.3...
Building data-default-0.5.3...
Preprocessing library data-default-0.5.3...
[1 of 1] Compiling Data.Default     ( Data/Default.hs, dist/build/Data/Default.o )
In-place registering data-default-0.5.3...
Running Haddock for data-default-0.5.3...
Running hscolour for data-default-0.5.3...
Preprocessing library data-default-0.5.3...
Preprocessing library data-default-0.5.3...
Haddock coverage:
  67% (  2 /  3) in 'Data.Default'
Documentation created: dist/doc/html/data-default/index.html
Installing library in
/srv/hackage/var/build/tmp-install/lib/x86_64-linux-ghc-7.6.3/data-default-0.5.3
Registering data-default-0.5.3...
Installed data-default-0.5.3
Configuring semigroups-0.12...
Building semigroups-0.12...
Preprocessing library semigroups-0.12...
[1 of 2] Compiling Data.List.NonEmpty ( src/Data/List/NonEmpty.hs, dist/build/Data/List/NonEmpty.o )
[2 of 2] Compiling Data.Semigroup   ( src/Data/Semigroup.hs, dist/build/Data/Semigroup.o )
In-place registering semigroups-0.12...
Running Haddock for semigroups-0.12...
Running hscolour for semigroups-0.12...
Preprocessing library semigroups-0.12...
Preprocessing library semigroups-0.12...
Warning: The documentation for the following packages are not installed. No
links will be generated to these packages: text-0.11.2.3
Haddock coverage:
  94% ( 62 / 66) in 'Data.List.NonEmpty'
  87% ( 20 / 23) in 'Data.Semigroup'
Warning: Data.Semigroup: could not find link destinations for:
    Data.Text.Internal.Text Data.Text.Lazy.Internal.Text
Documentation created: dist/doc/html/semigroups/index.html
Installing library in
/srv/hackage/var/build/tmp-install/lib/x86_64-linux-ghc-7.6.3/semigroups-0.12
Registering semigroups-0.12...
Installed semigroups-0.12
[1 of 1] Compiling Main             ( /tmp/comonad-4.0-29618/comonad-4.0/Setup.lhs, /tmp/comonad-4.0-29618/comonad-4.0/dist/setup/Main.o )
Linking /tmp/comonad-4.0-29618/comonad-4.0/dist/setup/setup ...
Configuring comonad-4.0...
Building comonad-4.0...
Preprocessing library comonad-4.0...
[ 1 of 16] Compiling Data.Functor.Composition ( src/Data/Functor/Composition.hs, dist/build/Data/Functor/Composition.o )
[ 2 of 16] Compiling Control.Comonad.Trans.Identity ( src/Control/Comonad/Trans/Identity.hs, dist/build/Control/Comonad/Trans/Identity.o )
[ 3 of 16] Compiling Control.Comonad  ( src/Control/Comonad.hs, dist/build/Control/Comonad.o )
[ 4 of 16] Compiling Control.Comonad.Trans.Class ( src/Control/Comonad/Trans/Class.hs, dist/build/Control/Comonad/Trans/Class.o )
[ 5 of 16] Compiling Control.Comonad.Hoist.Class ( src/Control/Comonad/Hoist/Class.hs, dist/build/Control/Comonad/Hoist/Class.o )
[ 6 of 16] Compiling Control.Comonad.Trans.Env ( src/Control/Comonad/Trans/Env.hs, dist/build/Control/Comonad/Trans/Env.o )
[ 7 of 16] Compiling Control.Comonad.Trans.Store ( src/Control/Comonad/Trans/Store.hs, dist/build/Control/Comonad/Trans/Store.o )
[ 8 of 16] Compiling Control.Comonad.Trans.Traced ( src/Control/Comonad/Trans/Traced.hs, dist/build/Control/Comonad/Trans/Traced.o )
[ 9 of 16] Compiling Control.Comonad.Env.Class ( src/Control/Comonad/Env/Class.hs, dist/build/Control/Comonad/Env/Class.o )
[10 of 16] Compiling Control.Comonad.Env ( src/Control/Comonad/Env.hs, dist/build/Control/Comonad/Env.o )
[11 of 16] Compiling Control.Comonad.Identity ( src/Control/Comonad/Identity.hs, dist/build/Control/Comonad/Identity.o )
[12 of 16] Compiling Control.Comonad.Store.Class ( src/Control/Comonad/Store/Class.hs, dist/build/Control/Comonad/Store/Class.o )
[13 of 16] Compiling Control.Comonad.Store ( src/Control/Comonad/Store.hs, dist/build/Control/Comonad/Store.o )
[14 of 16] Compiling Control.Comonad.Traced.Class ( src/Control/Comonad/Traced/Class.hs, dist/build/Control/Comonad/Traced/Class.o )
[15 of 16] Compiling Control.Comonad.Traced ( src/Control/Comonad/Traced.hs, dist/build/Control/Comonad/Traced.o )
[16 of 16] Compiling Data.Functor.Coproduct ( src/Data/Functor/Coproduct.hs, dist/build/Data/Functor/Coproduct.o )
In-place registering comonad-4.0...
Running Haddock for comonad-4.0...
Running hscolour for comonad-4.0...
Preprocessing library comonad-4.0...
Preprocessing library comonad-4.0...
Warning: The documentation for the following packages are not installed. No
links will be generated to these packages: rts-1.0, mtl-2.1.2, text-0.11.2.3,
transformers-0.3.0.0
Haddock coverage:
  50% (  1 /  2) in 'Data.Functor.Composition'
Warning: Couldn't find .haddock for export Control.Monad.Trans.Identity.IdentityT
  50% (  1 /  2) in 'Control.Comonad.Trans.Identity'
 100% ( 21 / 21) in 'Control.Comonad'
  50% (  1 /  2) in 'Control.Comonad.Trans.Class'
  50% (  1 /  2) in 'Control.Comonad.Hoist.Class'
  69% (  9 / 13) in 'Control.Comonad.Trans.Env'
haddock module header parse failed: Cannot parse header documentation paragraphs
doc comment parse failed:  Modify the stored value

 > pos . seeks swap $ store fst (1,5)
 (5,1)

 Seeks satisfies the law

 > seeks f = peeks f . duplicate
  60% (  9 / 15) in 'Control.Comonad.Trans.Store'
  33% (  4 / 12) in 'Control.Comonad.Trans.Traced'
  33% (  1 /  3) in 'Control.Comonad.Env.Class'
  60% (  9 / 15) in 'Control.Comonad.Env'
Warning: comonad-4.0:Control.Comonad.Identity: Could not find documentation for exported module: Data.Functor.Identity
 100% (  3 /  3) in 'Control.Comonad.Identity'
  25% (  1 /  4) in 'Control.Comonad.Store.Class'
  62% (  8 / 13) in 'Control.Comonad.Store'
  33% (  1 /  3) in 'Control.Comonad.Traced.Class'
  57% (  8 / 14) in 'Control.Comonad.Traced'
  20% (  1 /  5) in 'Data.Functor.Coproduct'
Warning: Data.Functor.Composition: could not find link destinations for:
    Data.Functor.Compose.Compose
Warning: Control.Comonad.Trans.Identity: could not find link destinations for:
    Control.Monad.Trans.Class.MonadTrans Control.Monad.IO.Class.MonadIO
Warning: Control.Comonad: could not find link destinations for:
    Data.Functor.Identity.Identity Data.Traversable.Id Data.Traversable.StateL Data.Traversable.StateR Data.Functor.Compose.Compose
Warning: Control.Comonad.Trans.Env: could not find link destinations for:
    Data.Functor.Identity.Identity
Warning: Control.Comonad.Trans.Store: could not find link destinations for:
    Data.Functor.Identity.Identity
Warning: Control.Comonad.Trans.Traced: could not find link destinations for:
    Data.Functor.Identity.Identity
Warning: Control.Comonad.Env: could not find link destinations for:
    Data.Functor.Identity.Identity
Warning: Control.Comonad.Store: could not find link destinations for:
    Data.Functor.Identity.Identity
Warning: Control.Comonad.Traced: could not find link destinations for:
    Data.Functor.Identity.Identity
Documentation created: dist/doc/html/comonad/index.html
Installing library in
/srv/hackage/var/build/tmp-install/lib/x86_64-linux-ghc-7.6.3/comonad-4.0
Registering comonad-4.0...
Installed comonad-4.0
Configuring void-0.6.1...
Building void-0.6.1...
Preprocessing library void-0.6.1...
[1 of 2] Compiling Data.Void        ( src/Data/Void.hs, dist/build/Data/Void.o )
[2 of 2] Compiling Data.Void.Unsafe ( src/Data/Void/Unsafe.hs, dist/build/Data/Void/Unsafe.o )
In-place registering void-0.6.1...
Running Haddock for void-0.6.1...
Running hscolour for void-0.6.1...
Preprocessing library void-0.6.1...
Preprocessing library void-0.6.1...
Warning: The documentation for the following packages are not installed. No
links will be generated to these packages: text-0.11.2.3
Haddock coverage:
 100% (  5 /  5) in 'Data.Void'
 100% (  3 /  3) in 'Data.Void.Unsafe'
Documentation created: dist/doc/html/void/index.html
Installing library in
/srv/hackage/var/build/tmp-install/lib/x86_64-linux-ghc-7.6.3/void-0.6.1
Registering void-0.6.1...
Installed void-0.6.1
Configuring zeromq3-haskell-0.5...
Building zeromq3-haskell-0.5...
Preprocessing library zeromq3-haskell-0.5...
Base.hsc:12:2: error: #error *** INVALID 0MQ VERSION (must be 3.x) ***
Base.hsc: In function ‘main’:
Base.hsc:12:2: error: #error *** INVALID 0MQ VERSION (must be 3.x) ***
Base.hsc:12:2: error: #error *** INVALID 0MQ VERSION (must be 3.x) ***
Base.hsc:20:5: error: ‘zmq_msg_t’ has no member named ‘_’
Base.hsc:21:5: error: ‘zmq_msg_t’ has no member named ‘_’
Base.hsc:76:5: error: ‘ZMQ_DELAY_ATTACH_ON_CONNECT’ undeclared (first use in this function)
Base.hsc:76:5: note: each undeclared identifier is reported only once for each function it appears in
Base.hsc:88:5: error: ‘ZMQ_IPV4ONLY’ undeclared (first use in this function)
Base.hsc:91:5: error: ‘ZMQ_LAST_ENDPOINT’ undeclared (first use in this function)
Base.hsc:97:5: error: ‘ZMQ_MAXMSGSIZE’ undeclared (first use in this function)
Base.hsc:100:5: error: ‘ZMQ_MULTICAST_HOPS’ undeclared (first use in this function)
Base.hsc:109:5: error: ‘ZMQ_RCVHWM’ undeclared (first use in this function)
Base.hsc:127:5: error: ‘ZMQ_ROUTER_MANDATORY’ undeclared (first use in this function)
Base.hsc:133:5: error: ‘ZMQ_SNDHWM’ undeclared (first use in this function)
Base.hsc:142:5: error: ‘ZMQ_TCP_ACCEPT_FILTER’ undeclared (first use in this function)
Base.hsc:145:5: error: ‘ZMQ_TCP_KEEPALIVE’ undeclared (first use in this function)
Base.hsc:148:5: error: ‘ZMQ_TCP_KEEPALIVE_CNT’ undeclared (first use in this function)
Base.hsc:151:5: error: ‘ZMQ_TCP_KEEPALIVE_IDLE’ undeclared (first use in this function)
Base.hsc:154:5: error: ‘ZMQ_TCP_KEEPALIVE_INTVL’ undeclared (first use in this function)
Base.hsc:160:5: error: ‘ZMQ_XPUB_VERBOSE’ undeclared (first use in this function)
Base.hsc:106:5: error: ‘ZMQ_IO_THREADS’ undeclared (first use in this function)
Base.hsc:109:5: error: ‘ZMQ_MAX_SOCKETS’ undeclared (first use in this function)
Base.hsc:113:5: error: ‘ZMQ_EVENT_CONNECTED’ undeclared (first use in this function)
Base.hsc:116:5: error: ‘ZMQ_EVENT_CONNECT_DELAYED’ undeclared (first use in this function)
Base.hsc:119:5: error: ‘ZMQ_EVENT_CONNECT_RETRIED’ undeclared (first use in this function)
Base.hsc:122:5: error: ‘ZMQ_EVENT_LISTENING’ undeclared (first use in this function)
Base.hsc:125:5: error: ‘ZMQ_EVENT_BIND_FAILED’ undeclared (first use in this function)
Base.hsc:128:5: error: ‘ZMQ_EVENT_ACCEPTED’ undeclared (first use in this function)
Base.hsc:131:5: error: ‘ZMQ_EVENT_ACCEPT_FAILED’ undeclared (first use in this function)
Base.hsc:134:5: error: ‘ZMQ_EVENT_CLOSED’ undeclared (first use in this function)
Base.hsc:137:5: error: ‘ZMQ_EVENT_CLOSE_FAILED’ undeclared (first use in this function)
Base.hsc:140:5: error: ‘ZMQ_EVENT_DISCONNECTED’ undeclared (first use in this function)
Base.hsc:143:5: error: ‘ZMQ_EVENT_ALL’ undeclared (first use in this function)
Base.hsc:128:5: error: unknown type name ‘zmq_event_t’
Base.hsc:129:5: error: unknown type name ‘zmq_event_t’
Base.hsc:133:5: error: ‘ZMQ_MORE’ undeclared (first use in this function)
Base.hsc:139:5: error: ‘ZMQ_DONTWAIT’ undeclared (first use in this function)
compiling dist/build/System/ZMQ3/Base_hsc_make.c failed (exit code 1)
command was: /usr/bin/gcc -c dist/build/System/ZMQ3/Base_hsc_make.c -o dist/build/System/ZMQ3/Base_hsc_make.o -fno-stack-protector -Wl,--hash-size=31 -Wl,--reduce-memory-overheads -D__GLASGOW_HASKELL__=706 -Dlinux_BUILD_OS=1 -Dx86_64_BUILD_ARCH=1 -Dlinux_HOST_OS=1 -Dx86_64_HOST_ARCH=1 -Idist/build/autogen -include dist/build/autogen/cabal_macros.h -Idist/build/autogen -include dist/build/autogen/cabal_macros.h -Idist/build/autogen -include dist/build/autogen/cabal_macros.h -Idist/build/autogen -include dist/build/autogen/cabal_macros.h -Idist/build/autogen -include dist/build/autogen/cabal_macros.h -Idist/build/autogen -include dist/build/autogen/cabal_macros.h -I/usr/local/lib/ghc-7.6.3/bytestring-0.10.0.2/include -Idist/build/autogen -include dist/build/autogen/cabal_macros.h -Idist/build/autogen -include dist/build/autogen/cabal_macros.h -Idist/build/autogen -include dist/build/autogen/cabal_macros.h -Idist/build/autogen -include dist/build/autogen/cabal_macros.h -Idist/build/autogen -include dist/build/autogen/cabal_macros.h -Idist/build/autogen -include dist/build/autogen/cabal_macros.h -Idist/build/autogen -include dist/build/autogen/cabal_macros.h -Idist/build/autogen -include dist/build/autogen/cabal_macros.h -Idist/build/autogen -include dist/build/autogen/cabal_macros.h -I/usr/local/lib/ghc-7.6.3/base-4.6.0.1/include -Idist/build/autogen -include dist/build/autogen/cabal_macros.h -Idist/build/autogen -include dist/build/autogen/cabal_macros.h -Idist/build/autogen -include dist/build/autogen/cabal_macros.h -I/usr/local/lib/ghc-7.6.3/include -Idist/build/autogen -include dist/build/autogen/cabal_macros.h -I/usr/local/lib/ghc-7.6.3/include/
Failed to install zeromq3-haskell-0.5
Configuring semigroupoids-4.0...
Building semigroupoids-4.0...
Preprocessing library semigroupoids-4.0...
[ 1 of 20] Compiling Data.Traversable.Instances ( src/Data/Traversable/Instances.hs, dist/build/Data/Traversable/Instances.o )
[ 2 of 20] Compiling Data.Functor.Extend ( src/Data/Functor/Extend.hs, dist/build/Data/Functor/Extend.o )
[ 3 of 20] Compiling Data.Functor.Bind ( src/Data/Functor/Bind.hs, dist/build/Data/Functor/Bind.o )
[ 4 of 20] Compiling Data.Functor.Bind.Trans ( src/Data/Functor/Bind/Trans.hs, dist/build/Data/Functor/Bind/Trans.o )
[ 5 of 20] Compiling Data.Semigroupoid ( src/Data/Semigroupoid.hs, dist/build/Data/Semigroupoid.o )
[ 6 of 20] Compiling Data.Semigroupoid.Dual ( src/Data/Semigroupoid/Dual.hs, dist/build/Data/Semigroupoid/Dual.o )
[ 7 of 20] Compiling Data.Groupoid    ( src/Data/Groupoid.hs, dist/build/Data/Groupoid.o )
[ 8 of 20] Compiling Data.Isomorphism ( src/Data/Isomorphism.hs, dist/build/Data/Isomorphism.o )
[ 9 of 20] Compiling Data.Semigroupoid.Product ( src/Data/Semigroupoid/Product.hs, dist/build/Data/Semigroupoid/Product.o )
[10 of 20] Compiling Data.Semigroupoid.Coproduct ( src/Data/Semigroupoid/Coproduct.hs, dist/build/Data/Semigroupoid/Coproduct.o )
[11 of 20] Compiling Data.Semigroupoid.Ob ( src/Data/Semigroupoid/Ob.hs, dist/build/Data/Semigroupoid/Ob.o )
[12 of 20] Compiling Data.Functor.Apply ( src/Data/Functor/Apply.hs, dist/build/Data/Functor/Apply.o )
[13 of 20] Compiling Data.Semigroup.Foldable ( src/Data/Semigroup/Foldable.hs, dist/build/Data/Semigroup/Foldable.o )
[14 of 20] Compiling Data.Semigroup.Traversable ( src/Data/Semigroup/Traversable.hs, dist/build/Data/Semigroup/Traversable.o )
[15 of 20] Compiling Data.Semifunctor ( src/Data/Semifunctor.hs, dist/build/Data/Semifunctor.o )
[16 of 20] Compiling Data.Semifunctor.Associative ( src/Data/Semifunctor/Associative.hs, dist/build/Data/Semifunctor/Associative.o )
[17 of 20] Compiling Data.Semifunctor.Braided ( src/Data/Semifunctor/Braided.hs, dist/build/Data/Semifunctor/Braided.o )
[18 of 20] Compiling Data.Functor.Alt ( src/Data/Functor/Alt.hs, dist/build/Data/Functor/Alt.o )
[19 of 20] Compiling Data.Functor.Plus ( src/Data/Functor/Plus.hs, dist/build/Data/Functor/Plus.o )
[20 of 20] Compiling Data.Semigroupoid.Static ( src/Data/Semigroupoid/Static.hs, dist/build/Data/Semigroupoid/Static.o )
In-place registering semigroupoids-4.0...
Running Haddock for semigroupoids-4.0...
Running hscolour for semigroupoids-4.0...
Preprocessing library semigroupoids-4.0...
Preprocessing library semigroupoids-4.0...
Warning: The documentation for the following packages are not installed. No
links will be generated to these packages: mtl-2.1.2, text-0.11.2.3,
transformers-0.3.0.0
Haddock coverage:
 100% (  1 /  1) in 'Data.Traversable.Instances'
  75% (  3 /  4) in 'Data.Functor.Extend'
  75% ( 15 / 20) in 'Data.Functor.Bind'
 100% (  2 /  2) in 'Data.Functor.Bind.Trans'
  50% (  2 /  4) in 'Data.Semigroupoid'
  50% (  1 /  2) in 'Data.Semigroupoid.Dual'
  50% (  1 /  2) in 'Data.Groupoid'
   0% (  0 /  2) in 'Data.Isomorphism'
   0% (  0 /  4) in 'Data.Semigroupoid.Product'
   0% (  0 /  6) in 'Data.Semigroupoid.Coproduct'
  50% (  1 /  2) in 'Data.Semigroupoid.Ob'
 100% ( 13 / 13) in 'Data.Functor.Apply'
  33% (  2 /  6) in 'Data.Semigroup.Foldable'
  33% (  1 /  3) in 'Data.Semigroup.Traversable'
  40% (  6 / 15) in 'Data.Semifunctor'
  14% (  1 /  7) in 'Data.Semifunctor.Associative'
  17% (  1 /  6) in 'Data.Semifunctor.Braided'
 100% (  3 /  3) in 'Data.Functor.Alt'
 100% (  3 /  3) in 'Data.Functor.Plus'
   0% (  0 /  2) in 'Data.Semigroupoid.Static'
Warning: Data.Functor.Extend: could not find link destinations for:
    Data.Functor.Identity.Identity
Warning: Data.Functor.Bind: could not find link destinations for:
    Data.Traversable.Id Data.Functor.Identity.Identity Data.Sequence.Digit Data.Sequence.Node Data.Sequence.Elem Data.Sequence.Id Data.Sequence.FingerTree Data.Traversable.StateL Data.Traversable.StateR Data.Sequence.State Control.Monad.Trans.Maybe.MaybeT Control.Monad.Trans.List.ListT Control.Monad.Trans.Cont.ContT Control.Monad.Trans.Error.ErrorT Control.Monad.Trans.Reader.ReaderT Control.Monad.Trans.State.Lazy.StateT Control.Monad.Trans.Writer.Lazy.WriterT Control.Monad.Trans.State.Strict.StateT Control.Monad.Trans.Writer.Strict.WriterT Data.Functor.Compose.Compose Data.Functor.Product.Product Control.Monad.Trans.RWS.Lazy.RWST Control.Monad.Trans.RWS.Strict.RWST
Warning: Data.Functor.Bind.Trans: could not find link destinations for:
    Control.Monad.Trans.Class.MonadTrans Control.Monad.Trans.Cont.ContT Control.Monad.Trans.Reader.ReaderT Control.Monad.Trans.State.Lazy.StateT Control.Monad.Trans.Writer.Lazy.WriterT Control.Monad.Trans.State.Strict.StateT Control.Monad.Trans.Writer.Strict.WriterT Control.Monad.Trans.RWS.Lazy.RWST Control.Monad.Trans.RWS.Strict.RWST
Warning: Data.Functor.Apply: could not find link destinations for:
    Data.Traversable.Id Data.Functor.Identity.Identity Data.Sequence.Digit Data.Sequence.Node Data.Sequence.Elem Data.Sequence.Id Data.Sequence.FingerTree Data.Traversable.StateL Data.Traversable.StateR Data.Sequence.State Control.Monad.Trans.Maybe.MaybeT Control.Monad.Trans.List.ListT Control.Monad.Trans.Cont.ContT Control.Monad.Trans.Error.ErrorT Control.Monad.Trans.Reader.ReaderT Control.Monad.Trans.State.Lazy.StateT Control.Monad.Trans.Writer.Lazy.WriterT Control.Monad.Trans.State.Strict.StateT Control.Monad.Trans.Writer.Strict.WriterT Data.Functor.Compose.Compose Data.Functor.Product.Product Control.Monad.Trans.RWS.Lazy.RWST Control.Monad.Trans.RWS.Strict.RWST
Warning: Data.Semigroup.Foldable: could not find link destinations for:
    Data.Functor.Identity.Identity Data.Functor.Compose.Compose Data.Functor.Product.Product
Warning: Data.Semigroup.Traversable: could not find link destinations for:
    Data.Functor.Identity.Identity Data.Functor.Compose.Compose Data.Functor.Product.Product
Warning: Data.Functor.Alt: could not find link destinations for:
    Control.Monad.Trans.Error.ErrorT Control.Monad.Trans.Maybe.MaybeT Control.Monad.Trans.List.ListT Control.Monad.Trans.Reader.ReaderT Control.Monad.Trans.State.Lazy.StateT Control.Monad.Trans.Writer.Lazy.WriterT Control.Monad.Trans.State.Strict.StateT Control.Monad.Trans.Writer.Strict.WriterT Control.Monad.Trans.RWS.Lazy.RWST Control.Monad.Trans.RWS.Strict.RWST
Warning: Data.Functor.Plus: could not find link destinations for:
    Control.Monad.Trans.Maybe.MaybeT Control.Monad.Trans.List.ListT Control.Monad.Trans.Error.Error Control.Monad.Trans.Error.ErrorT Control.Monad.Trans.Reader.ReaderT Control.Monad.Trans.State.Lazy.StateT Control.Monad.Trans.Writer.Lazy.WriterT Control.Monad.Trans.State.Strict.StateT Control.Monad.Trans.Writer.Strict.WriterT Control.Monad.Trans.RWS.Lazy.RWST Control.Monad.Trans.RWS.Strict.RWST
Documentation created: dist/doc/html/semigroupoids/index.html
Installing library in
/srv/hackage/var/build/tmp-install/lib/x86_64-linux-ghc-7.6.3/semigroupoids-4.0
Registering semigroupoids-4.0...
Installed semigroupoids-4.0
Configuring bifunctors-4.1.1...
Building bifunctors-4.1.1...
Preprocessing library bifunctors-4.1.1...
[ 1 of 13] Compiling Data.Bifoldable  ( src/Data/Bifoldable.hs, dist/build/Data/Bifoldable.o )
[ 2 of 13] Compiling Data.Semigroup.Bifoldable ( src/Data/Semigroup/Bifoldable.hs, dist/build/Data/Semigroup/Bifoldable.o )
[ 3 of 13] Compiling Data.Bifunctor   ( src/Data/Bifunctor.hs, dist/build/Data/Bifunctor.o )
[ 4 of 13] Compiling Data.Bifunctor.Apply ( src/Data/Bifunctor/Apply.hs, dist/build/Data/Bifunctor/Apply.o )
[ 5 of 13] Compiling Data.Bitraversable ( src/Data/Bitraversable.hs, dist/build/Data/Bitraversable.o )
[ 6 of 13] Compiling Data.Semigroup.Bitraversable ( src/Data/Semigroup/Bitraversable.hs, dist/build/Data/Semigroup/Bitraversable.o )
[ 7 of 13] Compiling Data.Biapplicative ( src/Data/Biapplicative.hs, dist/build/Data/Biapplicative.o )
[ 8 of 13] Compiling Data.Bifunctor.Clown ( src/Data/Bifunctor/Clown.hs, dist/build/Data/Bifunctor/Clown.o )
[ 9 of 13] Compiling Data.Bifunctor.Flip ( src/Data/Bifunctor/Flip.hs, dist/build/Data/Bifunctor/Flip.o )
[10 of 13] Compiling Data.Bifunctor.Join ( src/Data/Bifunctor/Join.hs, dist/build/Data/Bifunctor/Join.o )
[11 of 13] Compiling Data.Bifunctor.Joker ( src/Data/Bifunctor/Joker.hs, dist/build/Data/Bifunctor/Joker.o )
[12 of 13] Compiling Data.Bifunctor.Product ( src/Data/Bifunctor/Product.hs, dist/build/Data/Bifunctor/Product.o )
[13 of 13] Compiling Data.Bifunctor.Wrapped ( src/Data/Bifunctor/Wrapped.hs, dist/build/Data/Bifunctor/Wrapped.o )
In-place registering bifunctors-4.1.1...
Running Haddock for bifunctors-4.1.1...
Running hscolour for bifunctors-4.1.1...
Preprocessing library bifunctors-4.1.1...
Preprocessing library bifunctors-4.1.1...
Warning: The documentation for the following packages are not installed. No
links will be generated to these packages: mtl-2.1.2, text-0.11.2.3,
transformers-0.3.0.0
Haddock coverage:
   6% (  1 / 17) in 'Data.Bifoldable'
  33% (  2 /  6) in 'Data.Semigroup.Bifoldable'
 100% (  2 /  2) in 'Data.Bifunctor'
  62% (  5 /  8) in 'Data.Bifunctor.Apply'
  12% (  1 /  8) in 'Data.Bitraversable'
  33% (  1 /  3) in 'Data.Semigroup.Bitraversable'
  62% (  5 /  8) in 'Data.Biapplicative'
 100% (  2 /  2) in 'Data.Bifunctor.Clown'
 100% (  2 /  2) in 'Data.Bifunctor.Flip'
 100% (  2 /  2) in 'Data.Bifunctor.Join'
 100% (  2 /  2) in 'Data.Bifunctor.Joker'
 100% (  2 /  2) in 'Data.Bifunctor.Product'
 100% (  2 /  2) in 'Data.Bifunctor.Wrapped'
Documentation created: dist/doc/html/bifunctors/index.html
Installing library in
/srv/hackage/var/build/tmp-install/lib/x86_64-linux-ghc-7.6.3/bifunctors-4.1.1
Registering bifunctors-4.1.1...
Installed bifunctors-4.1.1
Configuring profunctors-4.0.1...
Building profunctors-4.0.1...
Preprocessing library profunctors-4.0.1...
[1 of 7] Compiling Data.Profunctor.Trace ( src/Data/Profunctor/Trace.hs, dist/build/Data/Profunctor/Trace.o )
[2 of 7] Compiling Data.Profunctor.Unsafe ( src/Data/Profunctor/Unsafe.hs, dist/build/Data/Profunctor/Unsafe.o )
Loading package ghc-prim ... linking ... done.
Loading package integer-gmp ... linking ... done.
Loading package base ... linking ... done.
Loading package array-0.4.0.1 ... linking ... done.
Loading package deepseq-1.3.0.1 ... linking ... done.
Loading package containers-0.5.0.0 ... linking ... done.
Loading package tagged-0.7 ... linking ... done.
Loading package transformers-0.3.0.0 ... linking ... done.
Loading package transformers-compat-0.1.1.1 ... linking ... done.
Loading package contravariant-0.4.4 ... linking ... done.
Loading package distributive-0.3.2 ... linking ... done.
Loading package mtl-2.1.2 ... linking ... done.
Loading package bytestring-0.10.0.2 ... linking ... done.
Loading package text-0.11.2.3 ... linking ... done.
Loading package hashable-1.2.1.0 ... linking ... done.
Loading package nats-0.1.2 ... linking ... done.
Loading package unordered-containers-0.2.3.3 ... linking ... done.
Loading package semigroups-0.12 ... linking ... done.
Loading package comonad-4.0 ... linking ... done.
Loading package semigroupoids-4.0 ... linking ... done.
[3 of 7] Compiling Data.Profunctor  ( src/Data/Profunctor.hs, dist/build/Data/Profunctor.o )
[4 of 7] Compiling Data.Profunctor.Rep ( src/Data/Profunctor/Rep.hs, dist/build/Data/Profunctor/Rep.o )
[5 of 7] Compiling Data.Profunctor.Composition ( src/Data/Profunctor/Composition.hs, dist/build/Data/Profunctor/Composition.o )
[6 of 7] Compiling Data.Profunctor.Rift ( src/Data/Profunctor/Rift.hs, dist/build/Data/Profunctor/Rift.o )
[7 of 7] Compiling Data.Profunctor.Collage ( src/Data/Profunctor/Collage.hs, dist/build/Data/Profunctor/Collage.o )
In-place registering profunctors-4.0.1...
Running Haddock for profunctors-4.0.1...
Running hscolour for profunctors-4.0.1...
Preprocessing library profunctors-4.0.1...
Preprocessing library profunctors-4.0.1...
Warning: The documentation for the following packages are not installed. No
links will be generated to these packages: mtl-2.1.2, text-0.11.2.3,
transformers-0.3.0.0
Haddock coverage:
 100% (  2 /  2) in 'Data.Profunctor.Trace'
 100% (  3 /  3) in 'Data.Profunctor.Unsafe'
  91% ( 10 / 11) in 'Data.Profunctor'
Warning: Data.Profunctor.Rep: We do not support associated types in instances yet. These instances are affected:
Data.Profunctor.Rep.Representable (->), (GHC.Base.Monad m, GHC.Base.Functor m) =>
Data.Profunctor.Rep.Representable (Control.Arrow.Kleisli m), GHC.Base.Functor f =>
Data.Profunctor.Rep.Representable (Data.Profunctor.UpStar f), Data.Profunctor.Rep.Corepresentable (->), GHC.Base.Functor w =>
Data.Profunctor.Rep.Corepresentable (Control.Comonad.Cokleisli w), Data.Profunctor.Rep.Corepresentable Data.Tagged.Tagged, GHC.Base.Functor f =>
Data.Profunctor.Rep.Corepresentable (Data.Profunctor.DownStar f)
 100% (  7 /  7) in 'Data.Profunctor.Rep'
Warning: Data.Profunctor.Composition: We do not support associated types in instances yet. These instances are affected:
(Data.Profunctor.Rep.Representable p,
 Data.Profunctor.Rep.Representable q) =>
Data.Profunctor.Rep.Representable (Data.Profunctor.Composition.Procompose p q), (Data.Profunctor.Rep.Corepresentable p,
 Data.Profunctor.Rep.Corepresentable q) =>
Data.Profunctor.Rep.Corepresentable (Data.Profunctor.Composition.Procompose p q)
  92% ( 11 / 12) in 'Data.Profunctor.Composition'
  75% (  3 /  4) in 'Data.Profunctor.Rift'
 100% (  2 /  2) in 'Data.Profunctor.Collage'
Warning: Data.Profunctor.Rep: could not find link destinations for:
    Data.Profunctor.Rep.Iso
Warning: Data.Profunctor.Composition: could not find link destinations for:
    Data.Profunctor.Composition.Iso Data.Functor.Compose.Compose
Documentation created: dist/doc/html/profunctors/index.html
Installing library in
/srv/hackage/var/build/tmp-install/lib/x86_64-linux-ghc-7.6.3/profunctors-4.0.1
Registering profunctors-4.0.1...
Installed profunctors-4.0.1
[1 of 1] Compiling Main             ( /tmp/lens-3.10-29618/lens-3.10/Setup.lhs, /tmp/lens-3.10-29618/lens-3.10/dist/setup/Main.o )
Linking /tmp/lens-3.10-29618/lens-3.10/dist/setup/setup ...
Configuring lens-3.10...
Building lens-3.10...
Preprocessing library lens-3.10...
[ 1 of 79] Compiling Control.Lens.Internal.Instances ( src/Control/Lens/Internal/Instances.hs, dist/build/Control/Lens/Internal/Instances.o )
[ 2 of 79] Compiling Control.Lens.Internal.Prism ( src/Control/Lens/Internal/Prism.hs, dist/build/Control/Lens/Internal/Prism.o )
[ 3 of 79] Compiling Control.Lens.Internal.Iso ( src/Control/Lens/Internal/Iso.hs, dist/build/Control/Lens/Internal/Iso.o )
[ 4 of 79] Compiling Control.Lens.Internal.Level ( src/Control/Lens/Internal/Level.hs, dist/build/Control/Lens/Internal/Level.o )
[ 5 of 79] Compiling Control.Lens.Internal.Setter ( src/Control/Lens/Internal/Setter.hs, dist/build/Control/Lens/Internal/Setter.o )
[ 6 of 79] Compiling Control.Lens.Internal.Review ( src/Control/Lens/Internal/Review.hs, dist/build/Control/Lens/Internal/Review.o )
[ 7 of 79] Compiling Control.Lens.Internal.Getter ( src/Control/Lens/Internal/Getter.hs, dist/build/Control/Lens/Internal/Getter.o )
[ 8 of 79] Compiling Control.Lens.Internal.Indexed ( src/Control/Lens/Internal/Indexed.hs, dist/build/Control/Lens/Internal/Indexed.o )
[ 9 of 79] Compiling Control.Lens.Internal.Context ( src/Control/Lens/Internal/Context.hs, dist/build/Control/Lens/Internal/Context.o )
[10 of 79] Compiling Control.Lens.Internal.Bazaar ( src/Control/Lens/Internal/Bazaar.hs, dist/build/Control/Lens/Internal/Bazaar.o )
[11 of 79] Compiling Control.Lens.Internal.Magma ( src/Control/Lens/Internal/Magma.hs, dist/build/Control/Lens/Internal/Magma.o )
[12 of 79] Compiling Control.Lens.Internal.Fold ( src/Control/Lens/Internal/Fold.hs, dist/build/Control/Lens/Internal/Fold.o )
[13 of 79] Compiling Control.Lens.Internal.Action ( src/Control/Lens/Internal/Action.hs, dist/build/Control/Lens/Internal/Action.o )
[14 of 79] Compiling Control.Lens.Internal.Zoom ( src/Control/Lens/Internal/Zoom.hs, dist/build/Control/Lens/Internal/Zoom.o )
[15 of 79] Compiling Control.Lens.Type ( src/Control/Lens/Type.hs, dist/build/Control/Lens/Type.o )
[16 of 79] Compiling Control.Lens.Setter ( src/Control/Lens/Setter.hs, dist/build/Control/Lens/Setter.o )
Loading package ghc-prim ... linking ... done.
Loading package integer-gmp ... linking ... done.
Loading package base ... linking ... done.
Loading package array-0.4.0.1 ... linking ... done.
Loading package deepseq-1.3.0.1 ... linking ... done.
Loading package bytestring-0.10.0.2 ... linking ... done.
Loading package text-0.11.2.3 ... linking ... done.
Loading package hashable-1.2.1.0 ... linking ... done.
Loading package containers-0.5.0.0 ... linking ... done.
Loading package nats-0.1.2 ... linking ... done.
Loading package unordered-containers-0.2.3.3 ... linking ... done.
Loading package semigroups-0.12 ... linking ... done.
Loading package void-0.6.1 ... linking ... done.
Loading package primitive-0.5.1.0 ... linking ... done.
Loading package vector-0.10.9.1 ... linking ... done.
Loading package split-0.2.2 ... linking ... done.
Loading package tagged-0.7 ... linking ... done.
Loading package pretty-1.1.1.0 ... linking ... done.
Loading package template-haskell ... linking ... done.
Loading package reflection-1.3.2 ... linking ... done.
Loading package transformers-0.3.0.0 ... linking ... done.
Loading package transformers-compat-0.1.1.1 ... linking ... done.
Loading package contravariant-0.4.4 ... linking ... done.
Loading package distributive-0.3.2 ... linking ... done.
Loading package mtl-2.1.2 ... linking ... done.
Loading package comonad-4.0 ... linking ... done.
Loading package semigroupoids-4.0 ... linking ... done.
Loading package profunctors-4.0.1 ... linking ... done.
Loading package parallel-3.2.0.4 ... linking ... done.
Loading package generic-deriving-1.6.2 ... linking ... done.
Loading package filepath-1.3.0.1 ... linking ... done.
Loading package bifunctors-4.1.1 ... linking ... done.
Loading package extensible-exceptions-0.1.1.4 ... linking ... done.
Loading package monads-tf-0.1.0.1 ... linking ... done.
Loading package MonadCatchIO-transformers-0.3.1.0 ... linking ... done.
[17 of 79] Compiling Control.Lens.Reified ( src/Control/Lens/Reified.hs, dist/build/Control/Lens/Reified.o )
[18 of 79] Compiling Control.Lens.Simple ( src/Control/Lens/Simple.hs, dist/build/Control/Lens/Simple.o )
[19 of 79] Compiling Control.Lens.Iso ( src/Control/Lens/Iso.hs, dist/build/Control/Lens/Iso.o )
[20 of 79] Compiling Control.Lens.Getter ( src/Control/Lens/Getter.hs, dist/build/Control/Lens/Getter.o )
[21 of 79] Compiling Control.Lens.Review ( src/Control/Lens/Review.hs, dist/build/Control/Lens/Review.o )
[22 of 79] Compiling Control.Lens.Wrapped ( src/Control/Lens/Wrapped.hs, dist/build/Control/Lens/Wrapped.o )
[23 of 79] Compiling Control.Lens.Zoom ( src/Control/Lens/Zoom.hs, dist/build/Control/Lens/Zoom.o )
[24 of 79] Compiling Data.Set.Lens    ( src/Data/Set/Lens.hs, dist/build/Data/Set/Lens.o )
[25 of 79] Compiling Data.HashSet.Lens ( src/Data/HashSet/Lens.hs, dist/build/Data/HashSet/Lens.o )
[26 of 79] Compiling Control.Lens.Fold ( src/Control/Lens/Fold.hs, dist/build/Control/Lens/Fold.o )
[27 of 79] Compiling Control.Lens.Equality ( src/Control/Lens/Equality.hs, dist/build/Control/Lens/Equality.o )
[28 of 79] Compiling Control.Lens.Combinators ( src/Control/Lens/Combinators.hs, dist/build/Control/Lens/Combinators.o )
[29 of 79] Compiling Control.Lens.Lens ( src/Control/Lens/Lens.hs, dist/build/Control/Lens/Lens.o )
[30 of 79] Compiling Control.Lens.Loupe ( src/Control/Lens/Loupe.hs, dist/build/Control/Lens/Loupe.o )
[31 of 79] Compiling Control.Lens.Prism ( src/Control/Lens/Prism.hs, dist/build/Control/Lens/Prism.o )
[32 of 79] Compiling Control.Lens.Traversal ( src/Control/Lens/Traversal.hs, dist/build/Control/Lens/Traversal.o )
[33 of 79] Compiling Control.Lens.Indexed ( src/Control/Lens/Indexed.hs, dist/build/Control/Lens/Indexed.o )
[34 of 79] Compiling Control.Lens.Level ( src/Control/Lens/Level.hs, dist/build/Control/Lens/Level.o )
[35 of 79] Compiling Control.Lens.Internal.Zipper ( src/Control/Lens/Internal/Zipper.hs, dist/build/Control/Lens/Internal/Zipper.o )
[36 of 79] Compiling Control.Lens.Zipper ( src/Control/Lens/Zipper.hs, dist/build/Control/Lens/Zipper.o )
[37 of 79] Compiling Control.Lens.Tuple ( src/Control/Lens/Tuple.hs, dist/build/Control/Lens/Tuple.o )
[38 of 79] Compiling Control.Lens.Cons ( src/Control/Lens/Cons.hs, dist/build/Control/Lens/Cons.o )
[39 of 79] Compiling Control.Lens.Internal.Deque ( src/Control/Lens/Internal/Deque.hs, dist/build/Control/Lens/Internal/Deque.o )
[40 of 79] Compiling Control.Lens.Each ( src/Control/Lens/Each.hs, dist/build/Control/Lens/Each.o )
[41 of 79] Compiling Data.Data.Lens   ( src/Data/Data/Lens.hs, dist/build/Data/Data/Lens.o )
[42 of 79] Compiling Control.Lens.Plated ( src/Control/Lens/Plated.hs, dist/build/Control/Lens/Plated.o )
[43 of 79] Compiling Control.Lens.At  ( src/Control/Lens/At.hs, dist/build/Control/Lens/At.o )
[44 of 79] Compiling Language.Haskell.TH.Lens ( src/Language/Haskell/TH/Lens.hs, dist/build/Language/Haskell/TH/Lens.o )
[45 of 79] Compiling Control.Lens.TH  ( src/Control/Lens/TH.hs, dist/build/Control/Lens/TH.o )
[46 of 79] Compiling Control.Lens.Action ( src/Control/Lens/Action.hs, dist/build/Control/Lens/Action.o )
[47 of 79] Compiling Control.Lens.Operators ( src/Control/Lens/Operators.hs, dist/build/Control/Lens/Operators.o )
[48 of 79] Compiling Control.Lens.Internal.Exception ( src/Control/Lens/Internal/Exception.hs, dist/build/Control/Lens/Internal/Exception.o )
[49 of 79] Compiling Control.Lens.Internal ( src/Control/Lens/Internal.hs, dist/build/Control/Lens/Internal.o )
[50 of 79] Compiling Control.Lens     ( src/Control/Lens.hs, dist/build/Control/Lens.o )
[51 of 79] Compiling Control.Lens.Internal.ByteString ( src/Control/Lens/Internal/ByteString.hs, dist/build/Control/Lens/Internal/ByteString.o )
[52 of 79] Compiling Control.Monad.Error.Lens ( src/Control/Monad/Error/Lens.hs, dist/build/Control/Monad/Error/Lens.o )
[53 of 79] Compiling Control.Parallel.Strategies.Lens ( src/Control/Parallel/Strategies/Lens.hs, dist/build/Control/Parallel/Strategies/Lens.o )
[54 of 79] Compiling Control.Seq.Lens ( src/Control/Seq/Lens.hs, dist/build/Control/Seq/Lens.o )
[55 of 79] Compiling Data.Array.Lens  ( src/Data/Array/Lens.hs, dist/build/Data/Array/Lens.o )
[56 of 79] Compiling Data.Bits.Lens   ( src/Data/Bits/Lens.hs, dist/build/Data/Bits/Lens.o )
[57 of 79] Compiling Data.ByteString.Strict.Lens ( src/Data/ByteString/Strict/Lens.hs, dist/build/Data/ByteString/Strict/Lens.o )
[58 of 79] Compiling Data.ByteString.Lazy.Lens ( src/Data/ByteString/Lazy/Lens.hs, dist/build/Data/ByteString/Lazy/Lens.o )
[59 of 79] Compiling Data.ByteString.Lens ( src/Data/ByteString/Lens.hs, dist/build/Data/ByteString/Lens.o )
[60 of 79] Compiling Data.Complex.Lens ( src/Data/Complex/Lens.hs, dist/build/Data/Complex/Lens.o )
[61 of 79] Compiling Data.IntSet.Lens ( src/Data/IntSet/Lens.hs, dist/build/Data/IntSet/Lens.o )
[62 of 79] Compiling Data.List.Lens   ( src/Data/List/Lens.hs, dist/build/Data/List/Lens.o )
[63 of 79] Compiling Data.List.Split.Lens ( src/Data/List/Split/Lens.hs, dist/build/Data/List/Split/Lens.o )
[64 of 79] Compiling Data.Sequence.Lens ( src/Data/Sequence/Lens.hs, dist/build/Data/Sequence/Lens.o )
[65 of 79] Compiling Data.Text.Strict.Lens ( src/Data/Text/Strict/Lens.hs, dist/build/Data/Text/Strict/Lens.o )
[66 of 79] Compiling Data.Text.Lazy.Lens ( src/Data/Text/Lazy/Lens.hs, dist/build/Data/Text/Lazy/Lens.o )
[67 of 79] Compiling Data.Text.Lens   ( src/Data/Text/Lens.hs, dist/build/Data/Text/Lens.o )
[68 of 79] Compiling Data.Tree.Lens   ( src/Data/Tree/Lens.hs, dist/build/Data/Tree/Lens.o )
[69 of 79] Compiling Data.Typeable.Lens ( src/Data/Typeable/Lens.hs, dist/build/Data/Typeable/Lens.o )
[70 of 79] Compiling Data.Vector.Lens ( src/Data/Vector/Lens.hs, dist/build/Data/Vector/Lens.o )
[71 of 79] Compiling Data.Vector.Generic.Lens ( src/Data/Vector/Generic/Lens.hs, dist/build/Data/Vector/Generic/Lens.o )
[72 of 79] Compiling Generics.Deriving.Lens ( src/Generics/Deriving/Lens.hs, dist/build/Generics/Deriving/Lens.o )
[73 of 79] Compiling GHC.Generics.Lens ( src/GHC/Generics/Lens.hs, dist/build/GHC/Generics/Lens.o )
[74 of 79] Compiling System.FilePath.Lens ( src/System/FilePath/Lens.hs, dist/build/System/FilePath/Lens.o )
[75 of 79] Compiling Numeric.Lens     ( src/Numeric/Lens.hs, dist/build/Numeric/Lens.o )
[76 of 79] Compiling Control.Exception.Lens ( src/Control/Exception/Lens.hs, dist/build/Control/Exception/Lens.o )
[77 of 79] Compiling Data.Dynamic.Lens ( src/Data/Dynamic/Lens.hs, dist/build/Data/Dynamic/Lens.o )
[78 of 79] Compiling System.Exit.Lens ( src/System/Exit/Lens.hs, dist/build/System/Exit/Lens.o )
[79 of 79] Compiling System.IO.Error.Lens ( src/System/IO/Error/Lens.hs, dist/build/System/IO/Error/Lens.o )
In-place registering lens-3.10...
Running Haddock for lens-3.10...
Running hscolour for lens-3.10...
Preprocessing library lens-3.10...
Preprocessing library lens-3.10...
Warning: The documentation for the following packages are not installed. No
links will be generated to these packages: rts-1.0, mtl-2.1.2, text-0.11.2.3,
transformers-0.3.0.0
Haddock coverage:
 100% (  1 /  1) in 'Control.Lens.Internal.Instances'
 100% (  3 /  3) in 'Control.Lens.Internal.Prism'
 100% (  3 /  3) in 'Control.Lens.Internal.Iso'
 100% (  6 /  6) in 'Control.Lens.Internal.Level'
 100% (  4 /  4) in 'Control.Lens.Internal.Setter'
Warning: Control.Lens.Internal.Review: We do not support associated types in instances yet. These instances are affected:
Data.Profunctor.Rep.Corepresentable Control.Lens.Internal.Review.Reviewed
  83% (  5 /  6) in 'Control.Lens.Internal.Review'
 100% (  7 /  7) in 'Control.Lens.Internal.Getter'
Warning: Control.Lens.Internal.Indexed: We do not support associated types in instances yet. These instances are affected:
Data.Profunctor.Rep.Corepresentable (Control.Lens.Internal.Indexed.Indexed i), Data.Profunctor.Rep.Representable (Control.Lens.Internal.Indexed.Indexed i)
 100% ( 12 / 12) in 'Control.Lens.Internal.Indexed'
 100% ( 11 / 11) in 'Control.Lens.Internal.Context'
 100% (  6 /  6) in 'Control.Lens.Internal.Bazaar'
 100% ( 12 / 12) in 'Control.Lens.Internal.Magma'
 100% ( 13 / 13) in 'Control.Lens.Internal.Fold'
 100% (  4 /  4) in 'Control.Lens.Internal.Action'
Warning: Control.Lens.Internal.Zoom: Instances of type and data families are not yet supported. Instances of the following families will be filtered out:
  Zoomed, Magnified
 100% ( 14 / 14) in 'Control.Lens.Internal.Zoom'
 100% ( 53 / 53) in 'Control.Lens.Type'
 100% ( 78 / 78) in 'Control.Lens.Setter'
 100% ( 20 / 20) in 'Control.Lens.Reified'
 100% ( 13 / 13) in 'Control.Lens.Simple'
 100% ( 41 / 41) in 'Control.Lens.Iso'
 100% ( 32 / 32) in 'Control.Lens.Getter'
 100% ( 16 / 16) in 'Control.Lens.Review'
 100% ( 12 / 12) in 'Control.Lens.Wrapped'
 100% (  3 /  3) in 'Control.Lens.Zoom'
 100% (  3 /  3) in 'Data.Set.Lens'
 100% (  3 /  3) in 'Data.HashSet.Lens'
 100% (106 /106) in 'Control.Lens.Fold'
 100% ( 13 / 13) in 'Control.Lens.Equality'
 100% (  4 /  4) in 'Control.Lens.Combinators'
 100% ( 81 / 81) in 'Control.Lens.Lens'
 100% ( 19 / 19) in 'Control.Lens.Loupe'
 100% ( 24 / 24) in 'Control.Lens.Prism'
  97% ( 68 / 70) in 'Control.Lens.Traversal'
 100% ( 43 / 43) in 'Control.Lens.Indexed'
 100% (  4 /  4) in 'Control.Lens.Level'
Warning: Control.Lens.Internal.Zipper: Instances of type and data families are not yet supported. Instances of the following families will be filtered out:
  :>, Zipped
 100% ( 73 / 73) in 'Control.Lens.Internal.Zipper'
 100% ( 49 / 49) in 'Control.Lens.Zipper'
 100% ( 11 / 11) in 'Control.Lens.Tuple'
 100% ( 15 / 15) in 'Control.Lens.Cons'
 100% (  6 /  6) in 'Control.Lens.Internal.Deque'
Warning: Control.Lens.Each: Instances of type and data families are not yet supported. Instances of the following families will be filtered out:
  Index
 100% (  5 /  5) in 'Control.Lens.Each'
 100% ( 13 / 13) in 'Data.Data.Lens'
 100% ( 39 / 39) in 'Control.Lens.Plated'
Warning: Control.Lens.At: Instances of type and data families are not yet supported. Instances of the following families will be filtered out:
  IxValue
  95% ( 19 / 20) in 'Control.Lens.At'
 100% (  8 /  8) in 'Language.Haskell.TH.Lens'
  97% ( 37 / 38) in 'Control.Lens.TH'
 100% ( 26 / 26) in 'Control.Lens.Action'
 100% (130 /130) in 'Control.Lens.Operators'
 100% (  3 /  3) in 'Control.Lens.Internal.Exception'
 100% ( 14 / 14) in 'Control.Lens.Internal'
 100% ( 27 / 27) in 'Control.Lens'
 100% ( 11 / 11) in 'Control.Lens.Internal.ByteString'
 100% ( 15 / 15) in 'Control.Monad.Error.Lens'
 100% (  5 /  5) in 'Control.Parallel.Strategies.Lens'
 100% (  2 /  2) in 'Control.Seq.Lens'
 100% (  3 /  3) in 'Data.Array.Lens'
 100% ( 12 / 12) in 'Data.Bits.Lens'
 100% (  7 /  7) in 'Data.ByteString.Strict.Lens'
 100% (  7 /  7) in 'Data.ByteString.Lazy.Lens'
 100% (  4 /  4) in 'Data.ByteString.Lens'
 100% (  7 /  7) in 'Data.Complex.Lens'
 100% (  4 /  4) in 'Data.IntSet.Lens'
  86% (  6 /  7) in 'Data.List.Lens'
 100% ( 19 / 19) in 'Data.List.Split.Lens'
 100% (  6 /  6) in 'Data.Sequence.Lens'
 100% (  5 /  5) in 'Data.Text.Strict.Lens'
 100% (  5 /  5) in 'Data.Text.Lazy.Lens'
 100% (  3 /  3) in 'Data.Text.Lens'
 100% (  3 /  3) in 'Data.Tree.Lens'
 100% (  3 /  3) in 'Data.Typeable.Lens'
 100% (  9 /  9) in 'Data.Vector.Lens'
 100% ( 12 / 12) in 'Data.Vector.Generic.Lens'
 100% (  7 /  7) in 'Generics.Deriving.Lens'
 100% (  2 /  2) in 'GHC.Generics.Lens'
 100% ( 15 / 15) in 'System.FilePath.Lens'
 100% (  8 /  8) in 'Numeric.Lens'
 100% ( 61 / 61) in 'Control.Exception.Lens'
 100% (  2 /  2) in 'Data.Dynamic.Lens'
 100% (  4 /  4) in 'System.Exit.Lens'
  32% (  9 / 28) in 'System.IO.Error.Lens'
Warning: Control.Lens.Internal.Iso: could not find link destinations for:
    Data.Text.Internal.Text Data.Text.Lazy.Internal.Text
Warning: Control.Lens.Internal.Setter: could not find link destinations for:
    Data.Functor.Identity.Identity Control.Applicative.Backwards.Backwards Data.Functor.Compose.Compose
Warning: Control.Lens.Internal.Getter: could not find link destinations for:
    Data.Functor.Identity.Identity
Warning: Control.Lens.Internal.Action: could not find link destinations for:
    Data.Functor.Identity.Identity Control.Applicative.Backwards.Backwards
Warning: Control.Lens.Internal.Zoom: could not find link destinations for:
    Control.Monad.Trans.Maybe.MaybeT
Warning: Control.Lens.Setter: could not find link destinations for:
    Control.Monad.State.Class.MonadState Control.Monad.Writer.Class.MonadWriter Control.Monad.Writer.Class.pass Control.Monad.Writer.Class.censor Data.Functor.Identity.Identity Control.Applicative.Backwards.Backwards Data.Functor.Compose.Compose
Warning: Control.Lens.Iso: could not find link destinations for:
    Data.Text.Internal.Text Data.Text.Lazy.Internal.Text
Warning: Control.Lens.Getter: could not find link destinations for:
    Control.Monad.Reader.Class.MonadReader Control.Monad.State.Class.MonadState Control.Monad.Writer.Class.MonadWriter Control.Monad.Writer.Class.listen Control.Applicative.Backwards.Backwards Data.Functor.Reverse.Reverse Data.Functor.Constant.Constant Data.Functor.Compose.Compose Data.Functor.Product.Product Data.Functor.Identity.Identity
Warning: Control.Lens.Review: could not find link destinations for:
    Data.Functor.Identity.Identity Control.Monad.Reader.Class.MonadReader Control.Monad.State.Class.MonadState Control.Monad.State.Class.gets
Warning: Control.Lens.Wrapped: could not find link destinations for:
    Data.Functor.Identity.Identity Data.Functor.Constant.Constant Data.Functor.Reverse.Reverse Control.Monad.Trans.Maybe.MaybeT Control.Applicative.Backwards.Backwards Data.Functor.Compose.Compose
Warning: Control.Lens.Zoom: could not find link destinations for:
    Control.Monad.Reader.Class.MonadReader Control.Monad.State.Class.MonadState Control.Monad.Trans.Maybe.MaybeT
Warning: Control.Lens.Fold: could not find link destinations for:
    Control.Monad.Reader.Class.MonadReader Control.Monad.State.Class.MonadState Control.Applicative.Backwards.Backwards Data.Functor.Compose.Compose
Warning: Control.Lens.Lens: could not find link destinations for:
    Control.Monad.State.Class.MonadState Control.Monad.State.Class.state
Warning: Control.Lens.Loupe: could not find link destinations for:
    Control.Monad.State.Class.MonadState
Warning: Control.Lens.Traversal: could not find link destinations for:
    Control.Monad.Trans.State.Lazy.state Control.Applicative.Backwards.Backwards Data.Functor.Identity.Identity Data.Sequence.Digit Data.Sequence.Node Data.Sequence.Elem Data.Sequence.FingerTree Control.Monad.Trans.Maybe.MaybeT Data.Functor.Reverse.Reverse Data.Functor.Constant.Constant Data.Functor.Compose.Compose Data.Functor.Product.Product
Warning: Control.Lens.Indexed: could not find link destinations for:
    Data.Functor.Identity.Identity Data.Functor.Reverse.Reverse Control.Applicative.Backwards.Backwards
Warning: Control.Lens.Tuple: could not find link destinations for:
    Data.Functor.Identity.Identity
Warning: Control.Lens.Cons: could not find link destinations for:
    Data.Text.Internal.Text Data.Text.Lazy.Internal.Text Data.Functor.Identity.Identity
Warning: Control.Lens.Each: could not find link destinations for:
    Data.Text.Internal.Text Data.Text.Lazy.Internal.Text Data.Functor.Identity.Identity
Warning: Control.Lens.At: could not find link destinations for:
    Data.Text.Lazy.Internal.Text Data.Text.Internal.Text Data.Functor.Identity.Identity
Warning: Control.Lens.Action: could not find link destinations for:
    Control.Monad.Trans.Class.MonadTrans Data.Functor.Identity.Identity Control.Applicative.Backwards.Backwards
Warning: Control.Lens.Operators: could not find link destinations for:
    Control.Monad.State.Class.MonadState Control.Monad.State.Class.state Data.Functor.Identity.Identity
Warning: Control.Monad.Error.Lens: could not find link destinations for:
    Control.Monad.Error.Class.MonadError Control.Monad.Error.Class.throwError
Warning: Data.Bits.Lens: could not find link destinations for:
    Control.Monad.State.Class.MonadState
Warning: Data.Text.Strict.Lens: could not find link destinations for:
    Data.Text.Internal.Text Data.Text.pack Data.Text.unpack Data.Text.Lazy.Builder.Builder Data.Text.Lazy.Builder.fromText Data.Text.Lazy.toStrict Data.Text.Lazy.Builder.toLazyText
Warning: Data.Text.Lazy.Lens: could not find link destinations for:
    Data.Text.Lazy.Internal.Text Data.Text.Lazy.pack Data.Text.Lazy.unpack Data.Text.Lazy.Builder.Builder Data.Text.Lazy.Builder.fromLazyText Data.Text.Lazy.Builder.toLazyText
Warning: Data.Text.Lens: could not find link destinations for:
    Data.Text.Lazy.Builder.Builder Data.Text.Internal.Text Data.Text.Lazy.pack Data.Text.Lazy.unpack Data.Text.Lazy.Builder.fromText Data.Text.Lazy.Internal.Text
Warning: System.FilePath.Lens: could not find link destinations for:
    Control.Monad.State.Class.MonadState
Warning: Numeric.Lens: could not find link destinations for:
    Numeric.Lens.digitToInt'
Warning: Control.Exception.Lens: could not find link destinations for:
    Control.Monad.IO.Class.MonadIO
Documentation created: dist/doc/html/lens/index.html
Installing library in
/srv/hackage/var/build/tmp-install/lib/x86_64-linux-ghc-7.6.3/lens-3.10
Registering lens-3.10...
Installed lens-3.10
cabal: Error: some packages failed to install:
cairo-0.12.5.0 failed during the configure step. The exception was:
ExitFailure 1
gio-0.12.5.0 depends on glib-0.12.5.0 which failed to install.
glib-0.12.5.0 failed during the configure step. The exception was:
ExitFailure 1
gtk-0.12.5.0 depends on glib-0.12.5.0 which failed to install.
hbro-1.1.2.0 depends on zeromq3-haskell-0.5 which failed to install.
hbro-contrib-0.8.0.0 depends on zeromq3-haskell-0.5 which failed to install.
pango-0.12.5.0 depends on glib-0.12.5.0 which failed to install.
webkit-0.12.5 depends on glib-0.12.5.0 which failed to install.
zeromq3-haskell-0.5 failed during the building phase. The exception was:
ExitFailure 1