Build #1 for intel-aes-0.1.2.2

[all reports]

Package intel-aes-0.1.2.2
Install BuildFailed
Docs NotTried
Tests NotTried
Time submitted unknown
Compiler ghc-7.6.3
OS linux
Arch x86_64
Dependencies unix-2.6.0.1, time-1.4.0.1, tagged-0.7, split-0.2.2, rdtsc-1.3.0.0, random-1.0.1.1, process-1.1.0.2, largeword-1.0.5, haskell98-2.0.0.2, crypto-api-0.12.2.2, cereal-0.4.0.1, bytestring-0.10.0.2, base-4.6.0.1, DRBG-0.5.1
Flags none

Code Coverage

No Code Coverage was submitted for this report.

Build log

[view raw]

Resolving dependencies...
Configuring byteable-0.1.1...
Building byteable-0.1.1...
Preprocessing library byteable-0.1.1...
[1 of 1] Compiling Data.Byteable    ( Data/Byteable.hs, dist/build/Data/Byteable.o )
In-place registering byteable-0.1.1...
Running Haddock for byteable-0.1.1...
Running hscolour for byteable-0.1.1...
Preprocessing library byteable-0.1.1...
Preprocessing library byteable-0.1.1...
Haddock coverage:
 100% (  3 /  3) in 'Data.Byteable'
Documentation created: dist/doc/html/byteable/index.html
Installing library in
/srv/hackage/var/build/tmp-install/lib/x86_64-linux-ghc-7.6.3/byteable-0.1.1
Registering byteable-0.1.1...
Installed byteable-0.1.1
Configuring cereal-0.4.0.1...
Building cereal-0.4.0.1...
Preprocessing library cereal-0.4.0.1...
[1 of 5] Compiling Data.Serialize.Builder ( src/Data/Serialize/Builder.hs, dist/build/Data/Serialize/Builder.o )
[2 of 5] Compiling Data.Serialize.Put ( src/Data/Serialize/Put.hs, dist/build/Data/Serialize/Put.o )
[3 of 5] Compiling Data.Serialize.Get ( src/Data/Serialize/Get.hs, dist/build/Data/Serialize/Get.o )
[4 of 5] Compiling Data.Serialize.IEEE754 ( src/Data/Serialize/IEEE754.hs, dist/build/Data/Serialize/IEEE754.o )
[5 of 5] Compiling Data.Serialize   ( src/Data/Serialize.hs, dist/build/Data/Serialize.o )
In-place registering cereal-0.4.0.1...
Running Haddock for cereal-0.4.0.1...
Running hscolour for cereal-0.4.0.1...
Preprocessing library cereal-0.4.0.1...
Preprocessing library cereal-0.4.0.1...
Haddock coverage:
  96% ( 26 / 27) in 'Data.Serialize.Builder'
  69% ( 29 / 42) in 'Data.Serialize.Put'
  94% ( 50 / 53) in 'Data.Serialize.Get'
 100% ( 11 / 11) in 'Data.Serialize.IEEE754'
Cannot find documentation for: $example
 100% ( 11 / 11) in 'Data.Serialize'
Warning: Data.Serialize.Put: could not find link destinations for:
    Data.Serialize.Put.PairS
Warning: Data.Serialize.Get: could not find link destinations for:
    Data.Serialize.Get.get
Documentation created: dist/doc/html/cereal/index.html
Installing library in
/srv/hackage/var/build/tmp-install/lib/x86_64-linux-ghc-7.6.3/cereal-0.4.0.1
Registering cereal-0.4.0.1...
Installed cereal-0.4.0.1
[1 of 1] Compiling Main             ( /tmp/entropy-0.2.2.4-12934/entropy-0.2.2.4/Setup.hs, /tmp/entropy-0.2.2.4-12934/entropy-0.2.2.4/dist/setup/Main.o )
Linking /tmp/entropy-0.2.2.4-12934/entropy-0.2.2.4/dist/setup/setup ...
Configuring entropy-0.2.2.4...
Result of RDRAND Test: True
Building entropy-0.2.2.4...
Preprocessing library entropy-0.2.2.4...
[1 of 1] Compiling System.Entropy   ( System/Entropy.hs, dist/build/System/Entropy.o )
In-place registering entropy-0.2.2.4...
Running Haddock for entropy-0.2.2.4...
Running hscolour for entropy-0.2.2.4...
Preprocessing library entropy-0.2.2.4...
Preprocessing library entropy-0.2.2.4...
Warning: The documentation for the following packages are not installed. No
links will be generated to these packages: rts-1.0
Haddock coverage:
 100% (  6 /  6) in 'System.Entropy'
Documentation created: dist/doc/html/entropy/index.html
Installing library in
/srv/hackage/var/build/tmp-install/lib/x86_64-linux-ghc-7.6.3/entropy-0.2.2.4
Registering entropy-0.2.2.4...
Installed entropy-0.2.2.4
Configuring largeword-1.0.5...
Building largeword-1.0.5...
Preprocessing library largeword-1.0.5...
[1 of 1] Compiling Data.LargeWord   ( Data/LargeWord.hs, dist/build/Data/LargeWord.o )
In-place registering largeword-1.0.5...
Running Haddock for largeword-1.0.5...
Running hscolour for largeword-1.0.5...
Preprocessing library largeword-1.0.5...
Preprocessing library largeword-1.0.5...
Haddock coverage:
  10% (  1 / 10) in 'Data.LargeWord'
Warning: Data.LargeWord: could not find link destinations for:
    Data.LargeWord.LargeWord
Documentation created: dist/doc/html/largeword/index.html
Installing library in
/srv/hackage/var/build/tmp-install/lib/x86_64-linux-ghc-7.6.3/largeword-1.0.5
Registering largeword-1.0.5...
Installed largeword-1.0.5
Configuring parallel-3.2.0.4...
Building parallel-3.2.0.4...
Preprocessing library parallel-3.2.0.4...
[1 of 3] Compiling Control.Parallel ( Control/Parallel.hs, dist/build/Control/Parallel.o )
[2 of 3] Compiling Control.Seq      ( Control/Seq.hs, dist/build/Control/Seq.o )
[3 of 3] Compiling Control.Parallel.Strategies ( Control/Parallel/Strategies.hs, dist/build/Control/Parallel/Strategies.o )
In-place registering parallel-3.2.0.4...
Running Haddock for parallel-3.2.0.4...
Running hscolour for parallel-3.2.0.4...
Preprocessing library parallel-3.2.0.4...
Preprocessing library parallel-3.2.0.4...
Haddock coverage:
 100% (  3 /  3) in 'Control.Parallel'
  72% ( 21 / 29) in 'Control.Seq'
  81% ( 68 / 84) in 'Control.Parallel.Strategies'
Documentation created: dist/doc/html/parallel/index.html
Installing library in
/srv/hackage/var/build/tmp-install/lib/x86_64-linux-ghc-7.6.3/parallel-3.2.0.4
Registering parallel-3.2.0.4...
Installed parallel-3.2.0.4
Configuring prettyclass-1.0.0.0...
Building prettyclass-1.0.0.0...
Preprocessing library prettyclass-1.0.0.0...
[1 of 1] Compiling Text.PrettyPrint.HughesPJClass ( src/Text/PrettyPrint/HughesPJClass.hs, dist/build/Text/PrettyPrint/HughesPJClass.o )
In-place registering prettyclass-1.0.0.0...
Running Haddock for prettyclass-1.0.0.0...
Running hscolour for prettyclass-1.0.0.0...
Preprocessing library prettyclass-1.0.0.0...
Preprocessing library prettyclass-1.0.0.0...
Haddock coverage:
  86% (  6 /  7) in 'Text.PrettyPrint.HughesPJClass'
Documentation created: dist/doc/html/prettyclass/index.html
Installing library in
/srv/hackage/var/build/tmp-install/lib/x86_64-linux-ghc-7.6.3/prettyclass-1.0.0.0
Registering prettyclass-1.0.0.0...
Installed prettyclass-1.0.0.0
Configuring rdtsc-1.3.0.0...
Building rdtsc-1.3.0.0...
Preprocessing library rdtsc-1.3.0.0...
[1 of 1] Compiling System.CPUTime.Rdtsc ( System/CPUTime/Rdtsc.hs, dist/build/System/CPUTime/Rdtsc.o )
In-place registering rdtsc-1.3.0.0...
Running Haddock for rdtsc-1.3.0.0...
Running hscolour for rdtsc-1.3.0.0...
Preprocessing library rdtsc-1.3.0.0...
Preprocessing library rdtsc-1.3.0.0...
Haddock coverage:
 100% (  2 /  2) in 'System.CPUTime.Rdtsc'
Documentation created: dist/doc/html/rdtsc/index.html
Installing library in
/srv/hackage/var/build/tmp-install/lib/x86_64-linux-ghc-7.6.3/rdtsc-1.3.0.0
Registering rdtsc-1.3.0.0...
Installed rdtsc-1.3.0.0
Configuring split-0.2.2...
Building split-0.2.2...
Preprocessing library split-0.2.2...
[1 of 2] Compiling Data.List.Split.Internals ( src/Data/List/Split/Internals.hs, dist/build/Data/List/Split/Internals.o )
[2 of 2] Compiling Data.List.Split  ( src/Data/List/Split.hs, dist/build/Data/List/Split.o )
In-place registering split-0.2.2...
Running Haddock for split-0.2.2...
Running hscolour for split-0.2.2...
Preprocessing library split-0.2.2...
Preprocessing library split-0.2.2...
Haddock coverage:
  91% ( 61 / 67) in 'Data.List.Split.Internals'
  90% ( 44 / 49) in 'Data.List.Split'
Documentation created: dist/doc/html/split/index.html
Installing library in
/srv/hackage/var/build/tmp-install/lib/x86_64-linux-ghc-7.6.3/split-0.2.2
Registering split-0.2.2...
Installed split-0.2.2
Configuring tagged-0.7...
Building tagged-0.7...
Preprocessing library tagged-0.7...
[1 of 2] Compiling Data.Proxy       ( old/Data/Proxy.hs, dist/build/Data/Proxy.o )
[2 of 2] Compiling Data.Tagged      ( src/Data/Tagged.hs, dist/build/Data/Tagged.o )
In-place registering tagged-0.7...
Running Haddock for tagged-0.7...
Running hscolour for tagged-0.7...
Preprocessing library tagged-0.7...
Preprocessing library tagged-0.7...
Haddock coverage:
  80% (  4 /  5) in 'Data.Proxy'
  92% ( 11 / 12) in 'Data.Tagged'
Documentation created: dist/doc/html/tagged/index.html
Installing library in
/srv/hackage/var/build/tmp-install/lib/x86_64-linux-ghc-7.6.3/tagged-0.7
Registering tagged-0.7...
Installed tagged-0.7
Configuring cryptohash-0.11.1...
Building cryptohash-0.11.1...
Preprocessing library cryptohash-0.11.1...
[ 1 of 21] Compiling Crypto.Hash.Utils.Cpu ( Crypto/Hash/Utils/Cpu.hs, dist/build/Crypto/Hash/Utils/Cpu.o )
[ 2 of 21] Compiling Crypto.MAC.HMAC  ( Crypto/MAC/HMAC.hs, dist/build/Crypto/MAC/HMAC.o )
[ 3 of 21] Compiling Crypto.Hash.Internal ( Crypto/Hash/Internal.hs, dist/build/Crypto/Hash/Internal.o )
[ 4 of 21] Compiling Crypto.Hash.Whirlpool ( Crypto/Hash/Whirlpool.hs, dist/build/Crypto/Hash/Whirlpool.o )
[ 5 of 21] Compiling Crypto.Hash.Skein512 ( Crypto/Hash/Skein512.hs, dist/build/Crypto/Hash/Skein512.o )
[ 6 of 21] Compiling Crypto.Hash.Skein256 ( Crypto/Hash/Skein256.hs, dist/build/Crypto/Hash/Skein256.o )
[ 7 of 21] Compiling Crypto.Hash.Tiger ( Crypto/Hash/Tiger.hs, dist/build/Crypto/Hash/Tiger.o )
[ 8 of 21] Compiling Crypto.Hash.RIPEMD160 ( Crypto/Hash/RIPEMD160.hs, dist/build/Crypto/Hash/RIPEMD160.o )
[ 9 of 21] Compiling Crypto.Hash.SHA3 ( Crypto/Hash/SHA3.hs, dist/build/Crypto/Hash/SHA3.o )
[10 of 21] Compiling Crypto.Hash.SHA512 ( Crypto/Hash/SHA512.hs, dist/build/Crypto/Hash/SHA512.o )
[11 of 21] Compiling Crypto.Hash.SHA512t ( Crypto/Hash/SHA512t.hs, dist/build/Crypto/Hash/SHA512t.o )
[12 of 21] Compiling Crypto.Hash.SHA384 ( Crypto/Hash/SHA384.hs, dist/build/Crypto/Hash/SHA384.o )
[13 of 21] Compiling Crypto.Hash.SHA256 ( Crypto/Hash/SHA256.hs, dist/build/Crypto/Hash/SHA256.o )
[14 of 21] Compiling Crypto.Hash.SHA224 ( Crypto/Hash/SHA224.hs, dist/build/Crypto/Hash/SHA224.o )
[15 of 21] Compiling Crypto.Hash.SHA1 ( Crypto/Hash/SHA1.hs, dist/build/Crypto/Hash/SHA1.o )
[16 of 21] Compiling Crypto.Hash.MD5  ( Crypto/Hash/MD5.hs, dist/build/Crypto/Hash/MD5.o )
[17 of 21] Compiling Crypto.Hash.MD4  ( Crypto/Hash/MD4.hs, dist/build/Crypto/Hash/MD4.o )
[18 of 21] Compiling Crypto.Hash.MD2  ( Crypto/Hash/MD2.hs, dist/build/Crypto/Hash/MD2.o )
[19 of 21] Compiling Crypto.Hash.Utils ( Crypto/Hash/Utils.hs, dist/build/Crypto/Hash/Utils.o )
[20 of 21] Compiling Crypto.Hash.Types ( Crypto/Hash/Types.hs, dist/build/Crypto/Hash/Types.o )
[21 of 21] Compiling Crypto.Hash      ( Crypto/Hash.hs, dist/build/Crypto/Hash.o )
In-place registering cryptohash-0.11.1...
Running Haddock for cryptohash-0.11.1...
Running hscolour for cryptohash-0.11.1...
Preprocessing library cryptohash-0.11.1...
Preprocessing library cryptohash-0.11.1...
Haddock coverage:
   0% (  0 /  2) in 'Crypto.Hash.Utils.Cpu'
 100% (  2 /  2) in 'Crypto.MAC.HMAC'
 100% (  2 /  2) in 'Crypto.Hash.Internal'
 100% ( 10 / 10) in 'Crypto.Hash.Whirlpool'
 100% ( 10 / 10) in 'Crypto.Hash.Skein512'
 100% ( 10 / 10) in 'Crypto.Hash.Skein256'
 100% ( 10 / 10) in 'Crypto.Hash.Tiger'
 100% ( 10 / 10) in 'Crypto.Hash.RIPEMD160'
 100% ( 10 / 10) in 'Crypto.Hash.SHA3'
 100% ( 11 / 11) in 'Crypto.Hash.SHA512'
 100% (  9 /  9) in 'Crypto.Hash.SHA512t'
 100% ( 10 / 10) in 'Crypto.Hash.SHA384'
 100% ( 10 / 10) in 'Crypto.Hash.SHA256'
 100% ( 10 / 10) in 'Crypto.Hash.SHA224'
 100% ( 10 / 10) in 'Crypto.Hash.SHA1'
 100% ( 10 / 10) in 'Crypto.Hash.MD5'
 100% ( 10 / 10) in 'Crypto.Hash.MD4'
 100% ( 10 / 10) in 'Crypto.Hash.MD2'
 100% (  2 /  2) in 'Crypto.Hash.Utils'
 100% (  7 /  7) in 'Crypto.Hash.Types'
 100% ( 40 / 40) in 'Crypto.Hash'
Documentation created: dist/doc/html/cryptohash/index.html
Installing library in
/srv/hackage/var/build/tmp-install/lib/x86_64-linux-ghc-7.6.3/cryptohash-0.11.1
Registering cryptohash-0.11.1...
Installed cryptohash-0.11.1
Configuring crypto-api-0.12.2.2...
Building crypto-api-0.12.2.2...
Preprocessing library crypto-api-0.12.2.2...
[1 of 8] Compiling Crypto.CPoly     ( Crypto/CPoly.hs, dist/build/Crypto/CPoly.o )
[2 of 8] Compiling Crypto.Types     ( Crypto/Types.hs, dist/build/Crypto/Types.o )
[3 of 8] Compiling Crypto.Util      ( Crypto/Util.hs, dist/build/Crypto/Util.o )
[4 of 8] Compiling Crypto.Random    ( Crypto/Random.hs, dist/build/Crypto/Random.o )
[5 of 8] Compiling Crypto.Classes   ( Crypto/Classes.hs, dist/build/Crypto/Classes.o )
[6 of 8] Compiling Crypto.HMAC      ( Crypto/HMAC.hs, dist/build/Crypto/HMAC.o )
[7 of 8] Compiling Crypto.Padding   ( Crypto/Padding.hs, dist/build/Crypto/Padding.o )
[8 of 8] Compiling Crypto.Modes     ( Crypto/Modes.hs, dist/build/Crypto/Modes.o )
In-place registering crypto-api-0.12.2.2...
Running Haddock for crypto-api-0.12.2.2...
Running hscolour for crypto-api-0.12.2.2...
Preprocessing library crypto-api-0.12.2.2...
Preprocessing library crypto-api-0.12.2.2...
Warning: The documentation for the following packages are not installed. No
links will be generated to these packages: transformers-0.3.0.0
Haddock coverage:
   0% (  0 /  4) in 'Crypto.CPoly'
 100% (  4 /  4) in 'Crypto.Types'
  91% ( 10 / 11) in 'Crypto.Util'
  90% (  9 / 10) in 'Crypto.Random'
 100% ( 24 / 24) in 'Crypto.Classes'
 100% (  4 /  4) in 'Crypto.HMAC'
 100% ( 13 / 13) in 'Crypto.Padding'
 100% ( 27 / 27) in 'Crypto.Modes'
Warning: Crypto.Modes: could not find link destinations for:
    Crypto.Modes.ecb'
Documentation created: dist/doc/html/crypto-api/index.html
Installing library in
/srv/hackage/var/build/tmp-install/lib/x86_64-linux-ghc-7.6.3/crypto-api-0.12.2.2
Registering crypto-api-0.12.2.2...
Installed crypto-api-0.12.2.2
[1 of 1] Compiling Main             ( /tmp/cipher-aes128-0.4.1-12934/cipher-aes128-0.4.1/Setup.hs, /tmp/cipher-aes128-0.4.1-12934/cipher-aes128-0.4.1/dist/setup/Main.o )
Linking /tmp/cipher-aes128-0.4.1-12934/cipher-aes128-0.4.1/dist/setup/setup ...
Configuring cipher-aes128-0.4.1...
Result of NI Intrinsics Test: True
Building cipher-aes128-0.4.1...
Preprocessing library cipher-aes128-0.4.1...
[1 of 2] Compiling Crypto.Cipher.AES128.Internal ( Crypto/Cipher/AES128/Internal.hs, dist/build/Crypto/Cipher/AES128/Internal.o )
[2 of 2] Compiling Crypto.Cipher.AES128 ( Crypto/Cipher/AES128.hs, dist/build/Crypto/Cipher/AES128.o )

Crypto/Cipher/AES128.hs:18:10: Warning:
    Orphan instance: instance Serialize AESKey

Crypto/Cipher/AES128.hs:30:10: Warning:
    Orphan instance: instance BlockCipher AESKey
In-place registering cipher-aes128-0.4.1...
Running Haddock for cipher-aes128-0.4.1...
Running hscolour for cipher-aes128-0.4.1...
Preprocessing library cipher-aes128-0.4.1...
Preprocessing library cipher-aes128-0.4.1...
Warning: The documentation for the following packages are not installed. No
links will be generated to these packages: rts-1.0, transformers-0.3.0.0

dist/build/tmp-14115/Crypto/Cipher/AES128.hs:18:10: Warning:
    Orphan instance: instance Serialize AESKey

dist/build/tmp-14115/Crypto/Cipher/AES128.hs:30:10: Warning:
    Orphan instance: instance BlockCipher AESKey
Haddock coverage:
   0% (  0 / 10) in 'Crypto.Cipher.AES128.Internal'
   0% (  0 /  2) in 'Crypto.Cipher.AES128'
Warning: Crypto.Cipher.AES128.Internal: could not find link destinations for:
    Crypto.Cipher.AES128.Internal.AESKeyStruct
Documentation created: dist/doc/html/cipher-aes128/index.html
Installing library in
/srv/hackage/var/build/tmp-install/lib/x86_64-linux-ghc-7.6.3/cipher-aes128-0.4.1
Registering cipher-aes128-0.4.1...
Installed cipher-aes128-0.4.1
Configuring cryptohash-cryptoapi-0.1.0...
Building cryptohash-cryptoapi-0.1.0...
Preprocessing library cryptohash-cryptoapi-0.1.0...
[1 of 1] Compiling Crypto.Hash.CryptoAPI ( Crypto/Hash/CryptoAPI.hs, dist/build/Crypto/Hash/CryptoAPI.o )

Crypto/Hash/CryptoAPI.hs:31:7: Warning:
    `hash' is exported by `hash' and `Hash(..)'

Crypto/Hash/CryptoAPI.hs:32:7: Warning:
    hash' is exported by hash' and `Hash(..)'
In-place registering cryptohash-cryptoapi-0.1.0...
Running Haddock for cryptohash-cryptoapi-0.1.0...
Running hscolour for cryptohash-cryptoapi-0.1.0...
Preprocessing library cryptohash-cryptoapi-0.1.0...
Preprocessing library cryptohash-cryptoapi-0.1.0...
Warning: The documentation for the following packages are not installed. No
links will be generated to these packages: transformers-0.3.0.0

dist/build/tmp-12934/Crypto/Hash/CryptoAPI.hs:31:7: Warning:
    `hash' is exported by `hash' and `Hash(..)'

dist/build/tmp-12934/Crypto/Hash/CryptoAPI.hs:32:7: Warning:
    hash' is exported by hash' and `Hash(..)'
Haddock coverage:
  24% (  4 / 17) in 'Crypto.Hash.CryptoAPI'
Documentation created: dist/doc/html/cryptohash-cryptoapi/index.html
Installing library in
/srv/hackage/var/build/tmp-install/lib/x86_64-linux-ghc-7.6.3/cryptohash-cryptoapi-0.1.0
Registering cryptohash-cryptoapi-0.1.0...
Installed cryptohash-cryptoapi-0.1.0
Configuring DRBG-0.5.1...
Building DRBG-0.5.1...
Preprocessing library DRBG-0.5.1...
[1 of 6] Compiling Crypto.Random.DRBG.Types ( Crypto/Random/DRBG/Types.hs, dist/build/Crypto/Random/DRBG/Types.o )
[2 of 6] Compiling Crypto.Random.DRBG.HashDF ( Crypto/Random/DRBG/HashDF.hs, dist/build/Crypto/Random/DRBG/HashDF.o )
[3 of 6] Compiling Crypto.Random.DRBG.HMAC ( Crypto/Random/DRBG/HMAC.hs, dist/build/Crypto/Random/DRBG/HMAC.o )
[4 of 6] Compiling Crypto.Random.DRBG.CTR ( Crypto/Random/DRBG/CTR.hs, dist/build/Crypto/Random/DRBG/CTR.o )
[5 of 6] Compiling Crypto.Random.DRBG.Hash ( Crypto/Random/DRBG/Hash.hs, dist/build/Crypto/Random/DRBG/Hash.o )
[6 of 6] Compiling Crypto.Random.DRBG ( Crypto/Random/DRBG.hs, dist/build/Crypto/Random/DRBG.o )
In-place registering DRBG-0.5.1...
Running Haddock for DRBG-0.5.1...
Running hscolour for DRBG-0.5.1...
Preprocessing library DRBG-0.5.1...
Preprocessing library DRBG-0.5.1...
Warning: The documentation for the following packages are not installed. No
links will be generated to these packages: mtl-2.1.2, transformers-0.3.0.0
Haddock coverage:
   0% (  0 /  7) in 'Crypto.Random.DRBG.Types'
   0% (  0 /  2) in 'Crypto.Random.DRBG.HashDF'
   0% (  0 /  7) in 'Crypto.Random.DRBG.HMAC'
  75% (  6 /  8) in 'Crypto.Random.DRBG.CTR'
   0% (  0 /  8) in 'Crypto.Random.DRBG.Hash'
 100% ( 18 / 18) in 'Crypto.Random.DRBG'
Documentation created: dist/doc/html/DRBG/index.html
Installing library in
/srv/hackage/var/build/tmp-install/lib/x86_64-linux-ghc-7.6.3/DRBG-0.5.1
Registering DRBG-0.5.1...
Installed DRBG-0.5.1
Downloading intel-aes-0.1.2.2...
[1 of 1] Compiling Main             ( /tmp/intel-aes-0.1.2.2-12934/intel-aes-0.1.2.2/Setup.hs, /tmp/intel-aes-0.1.2.2-12934/intel-aes-0.1.2.2/dist/setup/Main.o )
Linking /tmp/intel-aes-0.1.2.2-12934/intel-aes-0.1.2.2/dist/setup/setup ...
  [intel-aes] Running Setup.hs...
Configuring intel-aes-0.1.2.2...
  [intel-aes] Extra libraries initially: [["intel_aes"],[]]
  [intel-aes] Stripped extra libraries to: [[],[]]
  [intel-aes] Determined install dir to be: "/srv/hackage/var/build/tmp-install/lib/x86_64-linux-ghc-7.6.3/intel-aes-0.1.2.2"
  [intel-aes] Recorded install dir in ".temp.install_dir.txt"
  [intel-aes] Modified package info. 
cd Intel_AESNI_Sample_Library_v1.0/intel_aes_lib; make
make[1]: Entering directory `/tmp/intel-aes-0.1.2.2-12934/intel-aes-0.1.2.2/cbits/Intel_AESNI_Sample_Library_v1.0/intel_aes_lib'
gcc  -fPIC -O3 -g -Iinclude/ -c src/intel_aes.c -o obj/x64/intel_aes.o
In file included from src/intel_aes.c:34:0:
include/iaesni.h:65:2: warning: #warning "Configuring for Linux or Darwin" [-Wcpp]
yasm -D__linux__ -g dwarf2 -f elf64  asm/x64/iaesx64.s -o obj/x64/iaesx64.o
make[1]: yasm: Command not found
make[1]: *** [obj/x64/iaesx64.o] Error 127
make[1]: Leaving directory `/tmp/intel-aes-0.1.2.2-12934/intel-aes-0.1.2.2/cbits/Intel_AESNI_Sample_Library_v1.0/intel_aes_lib'
make: *** [all] Error 2
  [intel-aes] Running Setup.hs...

================================================================================
  [intel-aes] Running Makefile to build C/asm source...
  [intel-aes] Done with external build job.
================================================================================

  [intel-aes] Build action started.
  [intel-aes] Determined install dir to be: "/srv/hackage/var/build/tmp-install/lib/x86_64-linux-ghc-7.6.3/intel-aes-0.1.2.2"
  [intel-aes] Recorded install dir in ".temp.install_dir.txt"
  [intel-aes] Modified package info. 
Building intel-aes-0.1.2.2...
Preprocessing library intel-aes-0.1.2.2...
/usr/bin/ld: cannot find -lintel_aes
collect2: error: ld returned 1 exit status
linking dist/build/Codec/Crypto/GladmanAES_hsc_make.o failed (exit code 1)
command was: /usr/bin/gcc dist/build/Codec/Crypto/GladmanAES_hsc_make.o dist/build/Codec/Crypto/GladmanAES_hsc_utils.o -o dist/build/Codec/Crypto/GladmanAES_hsc_make -Wl,--hash-size=31 -Wl,--reduce-memory-overheads -L/tmp/intel-aes-0.1.2.2-12934/intel-aes-0.1.2.2/cbits/ -Wl,-R,/tmp/intel-aes-0.1.2.2-12934/intel-aes-0.1.2.2/cbits/ -lintel_aes -Wl,-rpath=/srv/hackage/var/build/tmp-install/lib/x86_64-linux-ghc-7.6.3/intel-aes-0.1.2.2 -Wl,-rpath=/tmp/intel-aes-0.1.2.2-12934/intel-aes-0.1.2.2/cbits/ -L/srv/hackage/var/build/tmp-install/lib/x86_64-linux-ghc-7.6.3/split-0.2.2 -Wl,-R,/srv/hackage/var/build/tmp-install/lib/x86_64-linux-ghc-7.6.3/split-0.2.2 -L/srv/hackage/var/build/tmp-install/lib/x86_64-linux-ghc-7.6.3/rdtsc-1.3.0.0 -Wl,-R,/srv/hackage/var/build/tmp-install/lib/x86_64-linux-ghc-7.6.3/rdtsc-1.3.0.0 -L/usr/local/lib/random-1.0.1.1/ghc-7.6.3 -Wl,-R,/usr/local/lib/random-1.0.1.1/ghc-7.6.3 -L/srv/hackage/var/build/tmp-install/lib/x86_64-linux-ghc-7.6.3/largeword-1.0.5 -Wl,-R,/srv/hackage/var/build/tmp-install/lib/x86_64-linux-ghc-7.6.3/largeword-1.0.5 -L/usr/local/lib/ghc-7.6.3/haskell98-2.0.0.2 -Wl,-R,/usr/local/lib/ghc-7.6.3/haskell98-2.0.0.2 -L/usr/local/lib/ghc-7.6.3/process-1.1.0.2 -Wl,-R,/usr/local/lib/ghc-7.6.3/process-1.1.0.2 -L/usr/local/lib/ghc-7.6.3/old-time-1.1.0.1 -Wl,-R,/usr/local/lib/ghc-7.6.3/old-time-1.1.0.1 -L/usr/local/lib/ghc-7.6.3/directory-1.2.0.1 -Wl,-R,/usr/local/lib/ghc-7.6.3/directory-1.2.0.1 -L/usr/local/lib/ghc-7.6.3/filepath-1.3.0.1 -Wl,-R,/usr/local/lib/ghc-7.6.3/filepath-1.3.0.1 -L/srv/hackage/var/build/tmp-install/lib/x86_64-linux-ghc-7.6.3/DRBG-0.5.1 -Wl,-R,/srv/hackage/var/build/tmp-install/lib/x86_64-linux-ghc-7.6.3/DRBG-0.5.1 -L/srv/hackage/var/build/tmp-install/lib/x86_64-linux-ghc-7.6.3/prettyclass-1.0.0.0 -Wl,-R,/srv/hackage/var/build/tmp-install/lib/x86_64-linux-ghc-7.6.3/prettyclass-1.0.0.0 -L/usr/local/lib/ghc-7.6.3/pretty-1.1.1.0 -Wl,-R,/usr/local/lib/ghc-7.6.3/pretty-1.1.1.0 -L/srv/hackage/var/build/tmp-install/lib/x86_64-linux-ghc-7.6.3/parallel-3.2.0.4 -Wl,-R,/srv/hackage/var/build/tmp-install/lib/x86_64-linux-ghc-7.6.3/parallel-3.2.0.4 -L/usr/local/lib/mtl-2.1.2/ghc-7.6.3 -Wl,-R,/usr/local/lib/mtl-2.1.2/ghc-7.6.3 -L/srv/hackage/var/build/tmp-install/lib/x86_64-linux-ghc-7.6.3/cryptohash-cryptoapi-0.1.0 -Wl,-R,/srv/hackage/var/build/tmp-install/lib/x86_64-linux-ghc-7.6.3/cryptohash-cryptoapi-0.1.0 -L/srv/hackage/var/build/tmp-install/lib/x86_64-linux-ghc-7.6.3/cryptohash-0.11.1 -Wl,-R,/srv/hackage/var/build/tmp-install/lib/x86_64-linux-ghc-7.6.3/cryptohash-0.11.1 -L/srv/hackage/var/build/tmp-install/lib/x86_64-linux-ghc-7.6.3/byteable-0.1.1 -Wl,-R,/srv/hackage/var/build/tmp-install/lib/x86_64-linux-ghc-7.6.3/byteable-0.1.1 -L/srv/hackage/var/build/tmp-install/lib/x86_64-linux-ghc-7.6.3/cipher-aes128-0.4.1 -Wl,-R,/srv/hackage/var/build/tmp-install/lib/x86_64-linux-ghc-7.6.3/cipher-aes128-0.4.1 -L/srv/hackage/var/build/tmp-install/lib/x86_64-linux-ghc-7.6.3/crypto-api-0.12.2.2 -Wl,-R,/srv/hackage/var/build/tmp-install/lib/x86_64-linux-ghc-7.6.3/crypto-api-0.12.2.2 -L/usr/local/lib/transformers-0.3.0.0/ghc-7.6.3 -Wl,-R,/usr/local/lib/transformers-0.3.0.0/ghc-7.6.3 -L/srv/hackage/var/build/tmp-install/lib/x86_64-linux-ghc-7.6.3/tagged-0.7 -Wl,-R,/srv/hackage/var/build/tmp-install/lib/x86_64-linux-ghc-7.6.3/tagged-0.7 -L/srv/hackage/var/build/tmp-install/lib/x86_64-linux-ghc-7.6.3/entropy-0.2.2.4 -Wl,-R,/srv/hackage/var/build/tmp-install/lib/x86_64-linux-ghc-7.6.3/entropy-0.2.2.4 -L/usr/local/lib/ghc-7.6.3/unix-2.6.0.1 -Wl,-R,/usr/local/lib/ghc-7.6.3/unix-2.6.0.1 -lrt -lutil -ldl -L/usr/local/lib/ghc-7.6.3/time-1.4.0.1 -Wl,-R,/usr/local/lib/ghc-7.6.3/time-1.4.0.1 -L/usr/local/lib/ghc-7.6.3/old-locale-1.0.0.5 -Wl,-R,/usr/local/lib/ghc-7.6.3/old-locale-1.0.0.5 -L/srv/hackage/var/build/tmp-install/lib/x86_64-linux-ghc-7.6.3/cereal-0.4.0.1 -Wl,-R,/srv/hackage/var/build/tmp-install/lib/x86_64-linux-ghc-7.6.3/cereal-0.4.0.1 -L/usr/local/lib/ghc-7.6.3/containers-0.5.0.0 -Wl,-R,/usr/local/lib/ghc-7.6.3/containers-0.5.0.0 -L/usr/local/lib/ghc-7.6.3/bytestring-0.10.0.2 -Wl,-R,/usr/local/lib/ghc-7.6.3/bytestring-0.10.0.2 -L/usr/local/lib/ghc-7.6.3/deepseq-1.3.0.1 -Wl,-R,/usr/local/lib/ghc-7.6.3/deepseq-1.3.0.1 -L/usr/local/lib/ghc-7.6.3/array-0.4.0.1 -Wl,-R,/usr/local/lib/ghc-7.6.3/array-0.4.0.1 -L/usr/local/lib/ghc-7.6.3/base-4.6.0.1 -Wl,-R,/usr/local/lib/ghc-7.6.3/base-4.6.0.1 -L/usr/local/lib/ghc-7.6.3/integer-gmp-0.5.0.0 -Wl,-R,/usr/local/lib/ghc-7.6.3/integer-gmp-0.5.0.0 -lgmp -L/usr/local/lib/ghc-7.6.3/ghc-prim-0.3.0.0 -Wl,-R,/usr/local/lib/ghc-7.6.3/ghc-prim-0.3.0.0 -L/usr/local/lib/ghc-7.6.3 -Wl,-R,/usr/local/lib/ghc-7.6.3 -lm -lrt -ldl
Failed to install intel-aes-0.1.2.2
cabal: Error: some packages failed to install:
intel-aes-0.1.2.2 failed during the building phase. The exception was:
ExitFailure 1