Build #8 for bindings-gsl-0.1.1

[all reports]

Package bindings-gsl-0.1.1
Install BuildFailed
Docs NotTried
Tests NotTried
Time submitted 2016-12-31 03:57:43.937006 UTC
Compiler ghc-8.0.1.20161018
OS linux
Arch x86_64
Dependencies base-4.9.0.0, bindings-DSL-1.0.23
Flags none

Code Coverage

No Code Coverage was submitted for this report.

Build log

[view raw]

Resolving dependencies...
Configuring bindings-DSL-1.0.23...
Building bindings-DSL-1.0.23...
Installed bindings-DSL-1.0.23
Configuring bindings-gsl-0.1.1...
Building bindings-gsl-0.1.1...
Failed to install bindings-gsl-0.1.1
Build log ( /home/builder/.cabal/logs/bindings-gsl-0.1.1.log ):
cabal: Entering directory '/tmp/cabal-tmp-664/bindings-gsl-0.1.1'
Configuring bindings-gsl-0.1.1...
Building bindings-gsl-0.1.1...
Preprocessing library bindings-gsl-0.1.1...
BasisSplines.hsc: In function ‘main’:
BasisSplines.hsc:20:5: warning: format ‘%lu’ expects argument of type ‘long unsigned int’, but argument 2 has type ‘int’ [-Wformat=]
BasisSplines.hsc:20:5: warning: format ‘%lu’ expects argument of type ‘long unsigned int’, but argument 2 has type ‘int’ [-Wformat=]
BasisSplines.hsc:20:5: warning: format ‘%lu’ expects argument of type ‘long unsigned int’, but argument 2 has type ‘int’ [-Wformat=]
BasisSplines.hsc:26:5: warning: format ‘%lu’ expects argument of type ‘long unsigned int’, but argument 2 has type ‘int’ [-Wformat=]
BasisSplines.hsc:26:5: warning: format ‘%lu’ expects argument of type ‘long unsigned int’, but argument 2 has type ‘int’ [-Wformat=]
BasisSplines.hsc:26:5: warning: format ‘%lu’ expects argument of type ‘long unsigned int’, but argument 2 has type ‘int’ [-Wformat=]
ChebyshevApproximations.hsc: In function ‘main’:
ChebyshevApproximations.hsc:18:5: warning: format ‘%lu’ expects argument of type ‘long unsigned int’, but argument 2 has type ‘int’ [-Wformat=]
ChebyshevApproximations.hsc:18:5: warning: format ‘%lu’ expects argument of type ‘long unsigned int’, but argument 2 has type ‘int’ [-Wformat=]
ChebyshevApproximations.hsc:18:5: warning: format ‘%lu’ expects argument of type ‘long unsigned int’, but argument 2 has type ‘int’ [-Wformat=]
Combinations.hsc: In function ‘main’:
Combinations.hsc:13:5: warning: format ‘%lu’ expects argument of type ‘long unsigned int’, but argument 2 has type ‘int’ [-Wformat=]
Combinations.hsc:13:5: warning: format ‘%lu’ expects argument of type ‘long unsigned int’, but argument 2 has type ‘int’ [-Wformat=]
Combinations.hsc:13:5: warning: format ‘%lu’ expects argument of type ‘long unsigned int’, but argument 2 has type ‘int’ [-Wformat=]
ComplexNumbers.hsc: In function ‘main’:
ComplexNumbers.hsc:30:5: warning: format ‘%lu’ expects argument of type ‘long unsigned int’, but argument 2 has type ‘int’ [-Wformat=]
ComplexNumbers.hsc:30:5: warning: format ‘%lu’ expects argument of type ‘long unsigned int’, but argument 2 has type ‘int’ [-Wformat=]
ComplexNumbers.hsc:30:5: warning: format ‘%lu’ expects argument of type ‘long unsigned int’, but argument 2 has type ‘int’ [-Wformat=]
ComplexNumbers.hsc:34:5: warning: format ‘%lu’ expects argument of type ‘long unsigned int’, but argument 2 has type ‘int’ [-Wformat=]
ComplexNumbers.hsc:34:5: warning: format ‘%lu’ expects argument of type ‘long unsigned int’, but argument 2 has type ‘int’ [-Wformat=]
ComplexNumbers.hsc:34:5: warning: format ‘%lu’ expects argument of type ‘long unsigned int’, but argument 2 has type ‘int’ [-Wformat=]
ComplexNumbers.hsc:38:5: warning: format ‘%lu’ expects argument of type ‘long unsigned int’, but argument 2 has type ‘int’ [-Wformat=]
ComplexNumbers.hsc:38:5: warning: format ‘%lu’ expects argument of type ‘long unsigned int’, but argument 2 has type ‘int’ [-Wformat=]
ComplexNumbers.hsc:38:5: warning: format ‘%lu’ expects argument of type ‘long unsigned int’, but argument 2 has type ‘int’ [-Wformat=]
DiscreteHankelTransforms.hsc: In function ‘main’:
DiscreteHankelTransforms.hsc:17:5: warning: format ‘%lu’ expects argument of type ‘long unsigned int’, but argument 2 has type ‘int’ [-Wformat=]
DiscreteHankelTransforms.hsc:17:5: warning: format ‘%lu’ expects argument of type ‘long unsigned int’, but argument 2 has type ‘int’ [-Wformat=]
DiscreteHankelTransforms.hsc:17:5: warning: format ‘%lu’ expects argument of type ‘long unsigned int’, but argument 2 has type ‘int’ [-Wformat=]
Eigensystems.hsc: In function ‘main’:
Eigensystems.hsc:15:5: warning: format ‘%lu’ expects argument of type ‘long unsigned int’, but argument 2 has type ‘int’ [-Wformat=]
Eigensystems.hsc:15:5: warning: format ‘%lu’ expects argument of type ‘long unsigned int’, but argument 2 has type ‘int’ [-Wformat=]
Eigensystems.hsc:15:5: warning: format ‘%lu’ expects argument of type ‘long unsigned int’, but argument 2 has type ‘int’ [-Wformat=]
Eigensystems.hsc:27:5: warning: format ‘%lu’ expects argument of type ‘long unsigned int’, but argument 2 has type ‘int’ [-Wformat=]
Eigensystems.hsc:27:5: warning: format ‘%lu’ expects argument of type ‘long unsigned int’, but argument 2 has type ‘int’ [-Wformat=]
Eigensystems.hsc:27:5: warning: format ‘%lu’ expects argument of type ‘long unsigned int’, but argument 2 has type ‘int’ [-Wformat=]
Eigensystems.hsc:38:5: warning: format ‘%lu’ expects argument of type ‘long unsigned int’, but argument 2 has type ‘int’ [-Wformat=]
Eigensystems.hsc:38:5: warning: format ‘%lu’ expects argument of type ‘long unsigned int’, but argument 2 has type ‘int’ [-Wformat=]
Eigensystems.hsc:38:5: warning: format ‘%lu’ expects argument of type ‘long unsigned int’, but argument 2 has type ‘int’ [-Wformat=]
Eigensystems.hsc:51:5: warning: format ‘%lu’ expects argument of type ‘long unsigned int’, but argument 2 has type ‘int’ [-Wformat=]
Eigensystems.hsc:51:5: warning: format ‘%lu’ expects argument of type ‘long unsigned int’, but argument 2 has type ‘int’ [-Wformat=]
Eigensystems.hsc:51:5: warning: format ‘%lu’ expects argument of type ‘long unsigned int’, but argument 2 has type ‘int’ [-Wformat=]
Eigensystems.hsc:65:5: warning: format ‘%lu’ expects argument of type ‘long unsigned int’, but argument 2 has type ‘int’ [-Wformat=]
Eigensystems.hsc:65:5: warning: format ‘%lu’ expects argument of type ‘long unsigned int’, but argument 2 has type ‘int’ [-Wformat=]
Eigensystems.hsc:65:5: warning: format ‘%lu’ expects argument of type ‘long unsigned int’, but argument 2 has type ‘int’ [-Wformat=]
Eigensystems.hsc:81:5: warning: format ‘%lu’ expects argument of type ‘long unsigned int’, but argument 2 has type ‘int’ [-Wformat=]
Eigensystems.hsc:81:5: warning: format ‘%lu’ expects argument of type ‘long unsigned int’, but argument 2 has type ‘int’ [-Wformat=]
Eigensystems.hsc:81:5: warning: format ‘%lu’ expects argument of type ‘long unsigned int’, but argument 2 has type ‘int’ [-Wformat=]
Eigensystems.hsc:96:5: warning: format ‘%lu’ expects argument of type ‘long unsigned int’, but argument 2 has type ‘int’ [-Wformat=]
Eigensystems.hsc:96:5: warning: format ‘%lu’ expects argument of type ‘long unsigned int’, but argument 2 has type ‘int’ [-Wformat=]
Eigensystems.hsc:96:5: warning: format ‘%lu’ expects argument of type ‘long unsigned int’, but argument 2 has type ‘int’ [-Wformat=]
Eigensystems.hsc:106:5: warning: format ‘%lu’ expects argument of type ‘long unsigned int’, but argument 2 has type ‘int’ [-Wformat=]
Eigensystems.hsc:106:5: warning: format ‘%lu’ expects argument of type ‘long unsigned int’, but argument 2 has type ‘int’ [-Wformat=]
Eigensystems.hsc:106:5: warning: format ‘%lu’ expects argument of type ‘long unsigned int’, but argument 2 has type ‘int’ [-Wformat=]
Eigensystems.hsc:116:5: warning: format ‘%lu’ expects argument of type ‘long unsigned int’, but argument 2 has type ‘int’ [-Wformat=]
Eigensystems.hsc:116:5: warning: format ‘%lu’ expects argument of type ‘long unsigned int’, but argument 2 has type ‘int’ [-Wformat=]
Eigensystems.hsc:116:5: warning: format ‘%lu’ expects argument of type ‘long unsigned int’, but argument 2 has type ‘int’ [-Wformat=]
Eigensystems.hsc:125:5: warning: format ‘%lu’ expects argument of type ‘long unsigned int’, but argument 2 has type ‘int’ [-Wformat=]
Eigensystems.hsc:125:5: warning: format ‘%lu’ expects argument of type ‘long unsigned int’, but argument 2 has type ‘int’ [-Wformat=]
Eigensystems.hsc:125:5: warning: format ‘%lu’ expects argument of type ‘long unsigned int’, but argument 2 has type ‘int’ [-Wformat=]
Eigensystems.hsc:135:5: warning: format ‘%lu’ expects argument of type ‘long unsigned int’, but argument 2 has type ‘int’ [-Wformat=]
Eigensystems.hsc:135:5: warning: format ‘%lu’ expects argument of type ‘long unsigned int’, but argument 2 has type ‘int’ [-Wformat=]
Eigensystems.hsc:135:5: warning: format ‘%lu’ expects argument of type ‘long unsigned int’, but argument 2 has type ‘int’ [-Wformat=]
Eigensystems.hsc:159:5: warning: format ‘%lu’ expects argument of type ‘long unsigned int’, but argument 2 has type ‘int’ [-Wformat=]
Eigensystems.hsc:159:5: warning: format ‘%lu’ expects argument of type ‘long unsigned int’, but argument 2 has type ‘int’ [-Wformat=]
Eigensystems.hsc:159:5: warning: format ‘%lu’ expects argument of type ‘long unsigned int’, but argument 2 has type ‘int’ [-Wformat=]
Eigensystems.hsc:178:5: warning: format ‘%lu’ expects argument of type ‘long unsigned int’, but argument 2 has type ‘int’ [-Wformat=]
Eigensystems.hsc:178:5: warning: format ‘%lu’ expects argument of type ‘long unsigned int’, but argument 2 has type ‘int’ [-Wformat=]
Eigensystems.hsc:178:5: warning: format ‘%lu’ expects argument of type ‘long unsigned int’, but argument 2 has type ‘int’ [-Wformat=]
FastFourierTransforms.hsc: In function ‘main’:
FastFourierTransforms.hsc:37:5: warning: format ‘%lu’ expects argument of type ‘long unsigned int’, but argument 2 has type ‘int’ [-Wformat=]
FastFourierTransforms.hsc:37:5: warning: format ‘%lu’ expects argument of type ‘long unsigned int’, but argument 2 has type ‘int’ [-Wformat=]
FastFourierTransforms.hsc:37:5: warning: format ‘%lu’ expects argument of type ‘long unsigned int’, but argument 2 has type ‘int’ [-Wformat=]
FastFourierTransforms.hsc:43:5: warning: format ‘%lu’ expects argument of type ‘long unsigned int’, but argument 2 has type ‘int’ [-Wformat=]
FastFourierTransforms.hsc:43:5: warning: format ‘%lu’ expects argument of type ‘long unsigned int’, but argument 2 has type ‘int’ [-Wformat=]
FastFourierTransforms.hsc:43:5: warning: format ‘%lu’ expects argument of type ‘long unsigned int’, but argument 2 has type ‘int’ [-Wformat=]
FastFourierTransforms.hsc:69:5: warning: format ‘%lu’ expects argument of type ‘long unsigned int’, but argument 2 has type ‘int’ [-Wformat=]
FastFourierTransforms.hsc:69:5: warning: format ‘%lu’ expects argument of type ‘long unsigned int’, but argument 2 has type ‘int’ [-Wformat=]
FastFourierTransforms.hsc:69:5: warning: format ‘%lu’ expects argument of type ‘long unsigned int’, but argument 2 has type ‘int’ [-Wformat=]
FastFourierTransforms.hsc:75:5: warning: format ‘%lu’ expects argument of type ‘long unsigned int’, but argument 2 has type ‘int’ [-Wformat=]
FastFourierTransforms.hsc:75:5: warning: format ‘%lu’ expects argument of type ‘long unsigned int’, but argument 2 has type ‘int’ [-Wformat=]
FastFourierTransforms.hsc:75:5: warning: format ‘%lu’ expects argument of type ‘long unsigned int’, but argument 2 has type ‘int’ [-Wformat=]
FastFourierTransforms.hsc:96:5: warning: format ‘%lu’ expects argument of type ‘long unsigned int’, but argument 2 has type ‘int’ [-Wformat=]
FastFourierTransforms.hsc:96:5: warning: format ‘%lu’ expects argument of type ‘long unsigned int’, but argument 2 has type ‘int’ [-Wformat=]
FastFourierTransforms.hsc:96:5: warning: format ‘%lu’ expects argument of type ‘long unsigned int’, but argument 2 has type ‘int’ [-Wformat=]
FastFourierTransforms.hsc:115:5: warning: format ‘%lu’ expects argument of type ‘long unsigned int’, but argument 2 has type ‘int’ [-Wformat=]
FastFourierTransforms.hsc:115:5: warning: format ‘%lu’ expects argument of type ‘long unsigned int’, but argument 2 has type ‘int’ [-Wformat=]
FastFourierTransforms.hsc:115:5: warning: format ‘%lu’ expects argument of type ‘long unsigned int’, but argument 2 has type ‘int’ [-Wformat=]
FastFourierTransforms.hsc:132:5: warning: format ‘%lu’ expects argument of type ‘long unsigned int’, but argument 2 has type ‘int’ [-Wformat=]
FastFourierTransforms.hsc:132:5: warning: format ‘%lu’ expects argument of type ‘long unsigned int’, but argument 2 has type ‘int’ [-Wformat=]
FastFourierTransforms.hsc:132:5: warning: format ‘%lu’ expects argument of type ‘long unsigned int’, but argument 2 has type ‘int’ [-Wformat=]
FastFourierTransforms.hsc:138:5: warning: format ‘%lu’ expects argument of type ‘long unsigned int’, but argument 2 has type ‘int’ [-Wformat=]
FastFourierTransforms.hsc:138:5: warning: format ‘%lu’ expects argument of type ‘long unsigned int’, but argument 2 has type ‘int’ [-Wformat=]
FastFourierTransforms.hsc:138:5: warning: format ‘%lu’ expects argument of type ‘long unsigned int’, but argument 2 has type ‘int’ [-Wformat=]
FastFourierTransforms.hsc:154:5: warning: format ‘%lu’ expects argument of type ‘long unsigned int’, but argument 2 has type ‘int’ [-Wformat=]
FastFourierTransforms.hsc:154:5: warning: format ‘%lu’ expects argument of type ‘long unsigned int’, but argument 2 has type ‘int’ [-Wformat=]
FastFourierTransforms.hsc:154:5: warning: format ‘%lu’ expects argument of type ‘long unsigned int’, but argument 2 has type ‘int’ [-Wformat=]
FastFourierTransforms.hsc:160:5: warning: format ‘%lu’ expects argument of type ‘long unsigned int’, but argument 2 has type ‘int’ [-Wformat=]
FastFourierTransforms.hsc:160:5: warning: format ‘%lu’ expects argument of type ‘long unsigned int’, but argument 2 has type ‘int’ [-Wformat=]
FastFourierTransforms.hsc:160:5: warning: format ‘%lu’ expects argument of type ‘long unsigned int’, but argument 2 has type ‘int’ [-Wformat=]
Histograms.hsc: In function ‘main’:
Histograms.hsc:14:5: warning: format ‘%lu’ expects argument of type ‘long unsigned int’, but argument 2 has type ‘int’ [-Wformat=]
Histograms.hsc:14:5: warning: format ‘%lu’ expects argument of type ‘long unsigned int’, but argument 2 has type ‘int’ [-Wformat=]
Histograms.hsc:14:5: warning: format ‘%lu’ expects argument of type ‘long unsigned int’, but argument 2 has type ‘int’ [-Wformat=]
Histograms.hsc:20:5: warning: format ‘%lu’ expects argument of type ‘long unsigned int’, but argument 2 has type ‘int’ [-Wformat=]
Histograms.hsc:20:5: warning: format ‘%lu’ expects argument of type ‘long unsigned int’, but argument 2 has type ‘int’ [-Wformat=]
Histograms.hsc:20:5: warning: format ‘%lu’ expects argument of type ‘long unsigned int’, but argument 2 has type ‘int’ [-Wformat=]
Histograms.hsc:69:5: warning: format ‘%lu’ expects argument of type ‘long unsigned int’, but argument 2 has type ‘int’ [-Wformat=]
Histograms.hsc:69:5: warning: format ‘%lu’ expects argument of type ‘long unsigned int’, but argument 2 has type ‘int’ [-Wformat=]
Histograms.hsc:69:5: warning: format ‘%lu’ expects argument of type ‘long unsigned int’, but argument 2 has type ‘int’ [-Wformat=]
Histograms.hsc:77:5: warning: format ‘%lu’ expects argument of type ‘long unsigned int’, but argument 2 has type ‘int’ [-Wformat=]
Histograms.hsc:77:5: warning: format ‘%lu’ expects argument of type ‘long unsigned int’, but argument 2 has type ‘int’ [-Wformat=]
Histograms.hsc:77:5: warning: format ‘%lu’ expects argument of type ‘long unsigned int’, but argument 2 has type ‘int’ [-Wformat=]
IeeeFloatingPointArithmetic.hsc: In function ‘main’:
IeeeFloatingPointArithmetic.hsc:20:5: warning: format ‘%lu’ expects argument of type ‘long unsigned int’, but argument 2 has type ‘int’ [-Wformat=]
IeeeFloatingPointArithmetic.hsc:20:5: warning: format ‘%lu’ expects argument of type ‘long unsigned int’, but argument 2 has type ‘int’ [-Wformat=]
IeeeFloatingPointArithmetic.hsc:20:5: warning: format ‘%lu’ expects argument of type ‘long unsigned int’, but argument 2 has type ‘int’ [-Wformat=]
IeeeFloatingPointArithmetic.hsc:27:5: warning: format ‘%lu’ expects argument of type ‘long unsigned int’, but argument 2 has type ‘int’ [-Wformat=]
IeeeFloatingPointArithmetic.hsc:27:5: warning: format ‘%lu’ expects argument of type ‘long unsigned int’, but argument 2 has type ‘int’ [-Wformat=]
IeeeFloatingPointArithmetic.hsc:27:5: warning: format ‘%lu’ expects argument of type ‘long unsigned int’, but argument 2 has type ‘int’ [-Wformat=]
Interpolation.hsc: In function ‘main’:
Interpolation.hsc:14:5: warning: format ‘%lu’ expects argument of type ‘long unsigned int’, but argument 2 has type ‘int’ [-Wformat=]
Interpolation.hsc:14:5: warning: format ‘%lu’ expects argument of type ‘long unsigned int’, but argument 2 has type ‘int’ [-Wformat=]
Interpolation.hsc:14:5: warning: format ‘%lu’ expects argument of type ‘long unsigned int’, but argument 2 has type ‘int’ [-Wformat=]
Interpolation.hsc:26:5: warning: format ‘%lu’ expects argument of type ‘long unsigned int’, but argument 2 has type ‘int’ [-Wformat=]
Interpolation.hsc:26:5: warning: format ‘%lu’ expects argument of type ‘long unsigned int’, but argument 2 has type ‘int’ [-Wformat=]
Interpolation.hsc:26:5: warning: format ‘%lu’ expects argument of type ‘long unsigned int’, but argument 2 has type ‘int’ [-Wformat=]
Interpolation.hsc:34:5: warning: format ‘%lu’ expects argument of type ‘long unsigned int’, but argument 2 has type ‘int’ [-Wformat=]
Interpolation.hsc:34:5: warning: format ‘%lu’ expects argument of type ‘long unsigned int’, but argument 2 has type ‘int’ [-Wformat=]
Interpolation.hsc:34:5: warning: format ‘%lu’ expects argument of type ‘long unsigned int’, but argument 2 has type ‘int’ [-Wformat=]
Interpolation.hsc:67:5: warning: format ‘%lu’ expects argument of type ‘long unsigned int’, but argument 2 has type ‘int’ [-Wformat=]
Interpolation.hsc:67:5: warning: format ‘%lu’ expects argument of type ‘long unsigned int’, but argument 2 has type ‘int’ [-Wformat=]
Interpolation.hsc:67:5: warning: format ‘%lu’ expects argument of type ‘long unsigned int’, but argument 2 has type ‘int’ [-Wformat=]
LeastSquaresFitting.hsc: In function ‘main’:
LeastSquaresFitting.hsc:43:5: warning: format ‘%lu’ expects argument of type ‘long unsigned int’, but argument 2 has type ‘int’ [-Wformat=]
LeastSquaresFitting.hsc:43:5: warning: format ‘%lu’ expects argument of type ‘long unsigned int’, but argument 2 has type ‘int’ [-Wformat=]
LeastSquaresFitting.hsc:43:5: warning: format ‘%lu’ expects argument of type ‘long unsigned int’, but argument 2 has type ‘int’ [-Wformat=]
MathematicalFunctions.hsc: In function ‘main’:
MathematicalFunctions.hsc:30:5: warning: format ‘%lu’ expects argument of type ‘long unsigned int’, but argument 2 has type ‘int’ [-Wformat=]
MathematicalFunctions.hsc:30:5: warning: format ‘%lu’ expects argument of type ‘long unsigned int’, but argument 2 has type ‘int’ [-Wformat=]
MathematicalFunctions.hsc:30:5: warning: format ‘%lu’ expects argument of type ‘long unsigned int’, but argument 2 has type ‘int’ [-Wformat=]
MathematicalFunctions.hsc:39:5: warning: format ‘%lu’ expects argument of type ‘long unsigned int’, but argument 2 has type ‘int’ [-Wformat=]
MathematicalFunctions.hsc:39:5: warning: format ‘%lu’ expects argument of type ‘long unsigned int’, but argument 2 has type ‘int’ [-Wformat=]
MathematicalFunctions.hsc:39:5: warning: format ‘%lu’ expects argument of type ‘long unsigned int’, but argument 2 has type ‘int’ [-Wformat=]
MathematicalFunctions.hsc:48:5: warning: format ‘%lu’ expects argument of type ‘long unsigned int’, but argument 2 has type ‘int’ [-Wformat=]
MathematicalFunctions.hsc:48:5: warning: format ‘%lu’ expects argument of type ‘long unsigned int’, but argument 2 has type ‘int’ [-Wformat=]
MathematicalFunctions.hsc:48:5: warning: format ‘%lu’ expects argument of type ‘long unsigned int’, but argument 2 has type ‘int’ [-Wformat=]
MonteCarloIntegration.hsc: In function ‘main’:
MonteCarloIntegration.hsc:16:5: warning: format ‘%lu’ expects argument of type ‘long unsigned int’, but argument 2 has type ‘int’ [-Wformat=]
MonteCarloIntegration.hsc:16:5: warning: format ‘%lu’ expects argument of type ‘long unsigned int’, but argument 2 has type ‘int’ [-Wformat=]
MonteCarloIntegration.hsc:16:5: warning: format ‘%lu’ expects argument of type ‘long unsigned int’, but argument 2 has type ‘int’ [-Wformat=]
MonteCarloIntegration.hsc:23:5: warning: format ‘%lu’ expects argument of type ‘long unsigned int’, but argument 2 has type ‘int’ [-Wformat=]
MonteCarloIntegration.hsc:23:5: warning: format ‘%lu’ expects argument of type ‘long unsigned int’, but argument 2 has type ‘int’ [-Wformat=]
MonteCarloIntegration.hsc:23:5: warning: format ‘%lu’ expects argument of type ‘long unsigned int’, but argument 2 has type ‘int’ [-Wformat=]
MonteCarloIntegration.hsc:54:5: warning: format ‘%lu’ expects argument of type ‘long unsigned int’, but argument 2 has type ‘int’ [-Wformat=]
MonteCarloIntegration.hsc:54:5: warning: format ‘%lu’ expects argument of type ‘long unsigned int’, but argument 2 has type ‘int’ [-Wformat=]
MonteCarloIntegration.hsc:54:5: warning: format ‘%lu’ expects argument of type ‘long unsigned int’, but argument 2 has type ‘int’ [-Wformat=]
MonteCarloIntegration.hsc:96:5: warning: format ‘%lu’ expects argument of type ‘long unsigned int’, but argument 2 has type ‘int’ [-Wformat=]
MonteCarloIntegration.hsc:96:5: warning: format ‘%lu’ expects argument of type ‘long unsigned int’, but argument 2 has type ‘int’ [-Wformat=]
MonteCarloIntegration.hsc:96:5: warning: format ‘%lu’ expects argument of type ‘long unsigned int’, but argument 2 has type ‘int’ [-Wformat=]
MultidimensionalMinimization.hsc: In function ‘main’:
MultidimensionalMinimization.hsc:14:5: warning: format ‘%lu’ expects argument of type ‘long unsigned int’, but argument 2 has type ‘int’ [-Wformat=]
MultidimensionalMinimization.hsc:14:5: warning: format ‘%lu’ expects argument of type ‘long unsigned int’, but argument 2 has type ‘int’ [-Wformat=]
MultidimensionalMinimization.hsc:14:5: warning: format ‘%lu’ expects argument of type ‘long unsigned int’, but argument 2 has type ‘int’ [-Wformat=]
MultidimensionalMinimization.hsc:24:5: warning: format ‘%lu’ expects argument of type ‘long unsigned int’, but argument 2 has type ‘int’ [-Wformat=]
MultidimensionalMinimization.hsc:24:5: warning: format ‘%lu’ expects argument of type ‘long unsigned int’, but argument 2 has type ‘int’ [-Wformat=]
MultidimensionalMinimization.hsc:24:5: warning: format ‘%lu’ expects argument of type ‘long unsigned int’, but argument 2 has type ‘int’ [-Wformat=]
MultidimensionalMinimization.hsc:39:5: warning: format ‘%lu’ expects argument of type ‘long unsigned int’, but argument 2 has type ‘int’ [-Wformat=]
MultidimensionalMinimization.hsc:39:5: warning: format ‘%lu’ expects argument of type ‘long unsigned int’, but argument 2 has type ‘int’ [-Wformat=]
MultidimensionalMinimization.hsc:39:5: warning: format ‘%lu’ expects argument of type ‘long unsigned int’, but argument 2 has type ‘int’ [-Wformat=]
MultidimensionalMinimization.hsc:48:5: warning: format ‘%lu’ expects argument of type ‘long unsigned int’, but argument 2 has type ‘int’ [-Wformat=]
MultidimensionalMinimization.hsc:48:5: warning: format ‘%lu’ expects argument of type ‘long unsigned int’, but argument 2 has type ‘int’ [-Wformat=]
MultidimensionalMinimization.hsc:48:5: warning: format ‘%lu’ expects argument of type ‘long unsigned int’, but argument 2 has type ‘int’ [-Wformat=]
MultidimensionalMinimization.hsc:69:5: warning: format ‘%lu’ expects argument of type ‘long unsigned int’, but argument 2 has type ‘int’ [-Wformat=]
MultidimensionalMinimization.hsc:69:5: warning: format ‘%lu’ expects argument of type ‘long unsigned int’, but argument 2 has type ‘int’ [-Wformat=]
MultidimensionalMinimization.hsc:69:5: warning: format ‘%lu’ expects argument of type ‘long unsigned int’, but argument 2 has type ‘int’ [-Wformat=]
MultidimensionalMinimization.hsc:79:5: warning: format ‘%lu’ expects argument of type ‘long unsigned int’, but argument 2 has type ‘int’ [-Wformat=]
MultidimensionalMinimization.hsc:79:5: warning: format ‘%lu’ expects argument of type ‘long unsigned int’, but argument 2 has type ‘int’ [-Wformat=]
MultidimensionalMinimization.hsc:79:5: warning: format ‘%lu’ expects argument of type ‘long unsigned int’, but argument 2 has type ‘int’ [-Wformat=]
MultidimensionalRootFinding.hsc: In function ‘main’:
MultidimensionalRootFinding.hsc:14:5: warning: format ‘%lu’ expects argument of type ‘long unsigned int’, but argument 2 has type ‘int’ [-Wformat=]
MultidimensionalRootFinding.hsc:14:5: warning: format ‘%lu’ expects argument of type ‘long unsigned int’, but argument 2 has type ‘int’ [-Wformat=]
MultidimensionalRootFinding.hsc:14:5: warning: format ‘%lu’ expects argument of type ‘long unsigned int’, but argument 2 has type ‘int’ [-Wformat=]
MultidimensionalRootFinding.hsc:27:5: warning: format ‘%lu’ expects argument of type ‘long unsigned int’, but argument 2 has type ‘int’ [-Wformat=]
MultidimensionalRootFinding.hsc:27:5: warning: format ‘%lu’ expects argument of type ‘long unsigned int’, but argument 2 has type ‘int’ [-Wformat=]
MultidimensionalRootFinding.hsc:27:5: warning: format ‘%lu’ expects argument of type ‘long unsigned int’, but argument 2 has type ‘int’ [-Wformat=]
MultidimensionalRootFinding.hsc:36:5: warning: format ‘%lu’ expects argument of type ‘long unsigned int’, but argument 2 has type ‘int’ [-Wformat=]
MultidimensionalRootFinding.hsc:36:5: warning: format ‘%lu’ expects argument of type ‘long unsigned int’, but argument 2 has type ‘int’ [-Wformat=]
MultidimensionalRootFinding.hsc:36:5: warning: format ‘%lu’ expects argument of type ‘long unsigned int’, but argument 2 has type ‘int’ [-Wformat=]
MultidimensionalRootFinding.hsc:53:5: warning: format ‘%lu’ expects argument of type ‘long unsigned int’, but argument 2 has type ‘int’ [-Wformat=]
MultidimensionalRootFinding.hsc:53:5: warning: format ‘%lu’ expects argument of type ‘long unsigned int’, but argument 2 has type ‘int’ [-Wformat=]
MultidimensionalRootFinding.hsc:53:5: warning: format ‘%lu’ expects argument of type ‘long unsigned int’, but argument 2 has type ‘int’ [-Wformat=]
MultidimensionalRootFinding.hsc:66:5: warning: format ‘%lu’ expects argument of type ‘long unsigned int’, but argument 2 has type ‘int’ [-Wformat=]
MultidimensionalRootFinding.hsc:66:5: warning: format ‘%lu’ expects argument of type ‘long unsigned int’, but argument 2 has type ‘int’ [-Wformat=]
MultidimensionalRootFinding.hsc:66:5: warning: format ‘%lu’ expects argument of type ‘long unsigned int’, but argument 2 has type ‘int’ [-Wformat=]
MultidimensionalRootFinding.hsc:76:5: warning: format ‘%lu’ expects argument of type ‘long unsigned int’, but argument 2 has type ‘int’ [-Wformat=]
MultidimensionalRootFinding.hsc:76:5: warning: format ‘%lu’ expects argument of type ‘long unsigned int’, but argument 2 has type ‘int’ [-Wformat=]
MultidimensionalRootFinding.hsc:76:5: warning: format ‘%lu’ expects argument of type ‘long unsigned int’, but argument 2 has type ‘int’ [-Wformat=]
NonlinearLeastSquaresFitting.hsc: In function ‘main’:
NonlinearLeastSquaresFitting.hsc:20:5: warning: format ‘%lu’ expects argument of type ‘long unsigned int’, but argument 2 has type ‘int’ [-Wformat=]
NonlinearLeastSquaresFitting.hsc:20:5: warning: format ‘%lu’ expects argument of type ‘long unsigned int’, but argument 2 has type ‘int’ [-Wformat=]
NonlinearLeastSquaresFitting.hsc:20:5: warning: format ‘%lu’ expects argument of type ‘long unsigned int’, but argument 2 has type ‘int’ [-Wformat=]
NonlinearLeastSquaresFitting.hsc:33:5: warning: format ‘%lu’ expects argument of type ‘long unsigned int’, but argument 2 has type ‘int’ [-Wformat=]
NonlinearLeastSquaresFitting.hsc:33:5: warning: format ‘%lu’ expects argument of type ‘long unsigned int’, but argument 2 has type ‘int’ [-Wformat=]
NonlinearLeastSquaresFitting.hsc:33:5: warning: format ‘%lu’ expects argument of type ‘long unsigned int’, but argument 2 has type ‘int’ [-Wformat=]
NonlinearLeastSquaresFitting.hsc:42:5: warning: format ‘%lu’ expects argument of type ‘long unsigned int’, but argument 2 has type ‘int’ [-Wformat=]
NonlinearLeastSquaresFitting.hsc:42:5: warning: format ‘%lu’ expects argument of type ‘long unsigned int’, but argument 2 has type ‘int’ [-Wformat=]
NonlinearLeastSquaresFitting.hsc:42:5: warning: format ‘%lu’ expects argument of type ‘long unsigned int’, but argument 2 has type ‘int’ [-Wformat=]
NonlinearLeastSquaresFitting.hsc:64:5: warning: format ‘%lu’ expects argument of type ‘long unsigned int’, but argument 2 has type ‘int’ [-Wformat=]
NonlinearLeastSquaresFitting.hsc:64:5: warning: format ‘%lu’ expects argument of type ‘long unsigned int’, but argument 2 has type ‘int’ [-Wformat=]
NonlinearLeastSquaresFitting.hsc:64:5: warning: format ‘%lu’ expects argument of type ‘long unsigned int’, but argument 2 has type ‘int’ [-Wformat=]
NonlinearLeastSquaresFitting.hsc:81:5: warning: format ‘%lu’ expects argument of type ‘long unsigned int’, but argument 2 has type ‘int’ [-Wformat=]
NonlinearLeastSquaresFitting.hsc:81:5: warning: format ‘%lu’ expects argument of type ‘long unsigned int’, but argument 2 has type ‘int’ [-Wformat=]
NonlinearLeastSquaresFitting.hsc:81:5: warning: format ‘%lu’ expects argument of type ‘long unsigned int’, but argument 2 has type ‘int’ [-Wformat=]
NonlinearLeastSquaresFitting.hsc:91:5: warning: format ‘%lu’ expects argument of type ‘long unsigned int’, but argument 2 has type ‘int’ [-Wformat=]
NonlinearLeastSquaresFitting.hsc:91:5: warning: format ‘%lu’ expects argument of type ‘long unsigned int’, but argument 2 has type ‘int’ [-Wformat=]
NonlinearLeastSquaresFitting.hsc:91:5: warning: format ‘%lu’ expects argument of type ‘long unsigned int’, but argument 2 has type ‘int’ [-Wformat=]
NTuples.hsc: In function ‘main’:
NTuples.hsc:14:5: warning: format ‘%lu’ expects argument of type ‘long unsigned int’, but argument 2 has type ‘int’ [-Wformat=]
NTuples.hsc:14:5: warning: format ‘%lu’ expects argument of type ‘long unsigned int’, but argument 2 has type ‘int’ [-Wformat=]
NTuples.hsc:14:5: warning: format ‘%lu’ expects argument of type ‘long unsigned int’, but argument 2 has type ‘int’ [-Wformat=]
NTuples.hsc:19:5: warning: format ‘%lu’ expects argument of type ‘long unsigned int’, but argument 2 has type ‘int’ [-Wformat=]
NTuples.hsc:19:5: warning: format ‘%lu’ expects argument of type ‘long unsigned int’, but argument 2 has type ‘int’ [-Wformat=]
NTuples.hsc:19:5: warning: format ‘%lu’ expects argument of type ‘long unsigned int’, but argument 2 has type ‘int’ [-Wformat=]
NTuples.hsc:24:5: warning: format ‘%lu’ expects argument of type ‘long unsigned int’, but argument 2 has type ‘int’ [-Wformat=]
NTuples.hsc:24:5: warning: format ‘%lu’ expects argument of type ‘long unsigned int’, but argument 2 has type ‘int’ [-Wformat=]
NTuples.hsc:24:5: warning: format ‘%lu’ expects argument of type ‘long unsigned int’, but argument 2 has type ‘int’ [-Wformat=]
NumericalIntegration.hsc: In function ‘main’:
NumericalIntegration.hsc:22:5: warning: format ‘%lu’ expects argument of type ‘long unsigned int’, but argument 2 has type ‘int’ [-Wformat=]
NumericalIntegration.hsc:22:5: warning: format ‘%lu’ expects argument of type ‘long unsigned int’, but argument 2 has type ‘int’ [-Wformat=]
NumericalIntegration.hsc:22:5: warning: format ‘%lu’ expects argument of type ‘long unsigned int’, but argument 2 has type ‘int’ [-Wformat=]
NumericalIntegration.hsc:36:5: warning: format ‘%lu’ expects argument of type ‘long unsigned int’, but argument 2 has type ‘int’ [-Wformat=]
NumericalIntegration.hsc:36:5: warning: format ‘%lu’ expects argument of type ‘long unsigned int’, but argument 2 has type ‘int’ [-Wformat=]
NumericalIntegration.hsc:36:5: warning: format ‘%lu’ expects argument of type ‘long unsigned int’, but argument 2 has type ‘int’ [-Wformat=]
NumericalIntegration.hsc:53:5: warning: format ‘%lu’ expects argument of type ‘long unsigned int’, but argument 2 has type ‘int’ [-Wformat=]
NumericalIntegration.hsc:53:5: warning: format ‘%lu’ expects argument of type ‘long unsigned int’, but argument 2 has type ‘int’ [-Wformat=]
NumericalIntegration.hsc:53:5: warning: format ‘%lu’ expects argument of type ‘long unsigned int’, but argument 2 has type ‘int’ [-Wformat=]
OneDimensionalMinimization.hsc: In function ‘main’:
OneDimensionalMinimization.hsc:15:5: warning: format ‘%lu’ expects argument of type ‘long unsigned int’, but argument 2 has type ‘int’ [-Wformat=]
OneDimensionalMinimization.hsc:15:5: warning: format ‘%lu’ expects argument of type ‘long unsigned int’, but argument 2 has type ‘int’ [-Wformat=]
OneDimensionalMinimization.hsc:15:5: warning: format ‘%lu’ expects argument of type ‘long unsigned int’, but argument 2 has type ‘int’ [-Wformat=]
OneDimensionalMinimization.hsc:27:5: warning: format ‘%lu’ expects argument of type ‘long unsigned int’, but argument 2 has type ‘int’ [-Wformat=]
OneDimensionalMinimization.hsc:27:5: warning: format ‘%lu’ expects argument of type ‘long unsigned int’, but argument 2 has type ‘int’ [-Wformat=]
OneDimensionalMinimization.hsc:27:5: warning: format ‘%lu’ expects argument of type ‘long unsigned int’, but argument 2 has type ‘int’ [-Wformat=]
OneDimensionalRootFinding.hsc: In function ‘main’:
OneDimensionalRootFinding.hsc:15:5: warning: format ‘%lu’ expects argument of type ‘long unsigned int’, but argument 2 has type ‘int’ [-Wformat=]
OneDimensionalRootFinding.hsc:15:5: warning: format ‘%lu’ expects argument of type ‘long unsigned int’, but argument 2 has type ‘int’ [-Wformat=]
OneDimensionalRootFinding.hsc:15:5: warning: format ‘%lu’ expects argument of type ‘long unsigned int’, but argument 2 has type ‘int’ [-Wformat=]
OneDimensionalRootFinding.hsc:24:5: warning: format ‘%lu’ expects argument of type ‘long unsigned int’, but argument 2 has type ‘int’ [-Wformat=]
OneDimensionalRootFinding.hsc:24:5: warning: format ‘%lu’ expects argument of type ‘long unsigned int’, but argument 2 has type ‘int’ [-Wformat=]
OneDimensionalRootFinding.hsc:24:5: warning: format ‘%lu’ expects argument of type ‘long unsigned int’, but argument 2 has type ‘int’ [-Wformat=]
OneDimensionalRootFinding.hsc:31:5: warning: format ‘%lu’ expects argument of type ‘long unsigned int’, but argument 2 has type ‘int’ [-Wformat=]
OneDimensionalRootFinding.hsc:31:5: warning: format ‘%lu’ expects argument of type ‘long unsigned int’, but argument 2 has type ‘int’ [-Wformat=]
OneDimensionalRootFinding.hsc:31:5: warning: format ‘%lu’ expects argument of type ‘long unsigned int’, but argument 2 has type ‘int’ [-Wformat=]
OneDimensionalRootFinding.hsc:38:5: warning: format ‘%lu’ expects argument of type ‘long unsigned int’, but argument 2 has type ‘int’ [-Wformat=]
OneDimensionalRootFinding.hsc:38:5: warning: format ‘%lu’ expects argument of type ‘long unsigned int’, but argument 2 has type ‘int’ [-Wformat=]
OneDimensionalRootFinding.hsc:38:5: warning: format ‘%lu’ expects argument of type ‘long unsigned int’, but argument 2 has type ‘int’ [-Wformat=]
OrdinaryDifferentialEquations.hsc: In function ‘main’:
OrdinaryDifferentialEquations.hsc:14:5: warning: format ‘%lu’ expects argument of type ‘long unsigned int’, but argument 2 has type ‘int’ [-Wformat=]
OrdinaryDifferentialEquations.hsc:14:5: warning: format ‘%lu’ expects argument of type ‘long unsigned int’, but argument 2 has type ‘int’ [-Wformat=]
OrdinaryDifferentialEquations.hsc:14:5: warning: format ‘%lu’ expects argument of type ‘long unsigned int’, but argument 2 has type ‘int’ [-Wformat=]
OrdinaryDifferentialEquations.hsc:28:5: warning: format ‘%lu’ expects argument of type ‘long unsigned int’, but argument 2 has type ‘int’ [-Wformat=]
OrdinaryDifferentialEquations.hsc:28:5: warning: format ‘%lu’ expects argument of type ‘long unsigned int’, but argument 2 has type ‘int’ [-Wformat=]
OrdinaryDifferentialEquations.hsc:28:5: warning: format ‘%lu’ expects argument of type ‘long unsigned int’, but argument 2 has type ‘int’ [-Wformat=]
OrdinaryDifferentialEquations.hsc:34:5: warning: format ‘%lu’ expects argument of type ‘long unsigned int’, but argument 2 has type ‘int’ [-Wformat=]
OrdinaryDifferentialEquations.hsc:34:5: warning: format ‘%lu’ expects argument of type ‘long unsigned int’, but argument 2 has type ‘int’ [-Wformat=]
OrdinaryDifferentialEquations.hsc:34:5: warning: format ‘%lu’ expects argument of type ‘long unsigned int’, but argument 2 has type ‘int’ [-Wformat=]
OrdinaryDifferentialEquations.hsc:61:5: warning: format ‘%lu’ expects argument of type ‘long unsigned int’, but argument 2 has type ‘int’ [-Wformat=]
OrdinaryDifferentialEquations.hsc:61:5: warning: format ‘%lu’ expects argument of type ‘long unsigned int’, but argument 2 has type ‘int’ [-Wformat=]
OrdinaryDifferentialEquations.hsc:61:5: warning: format ‘%lu’ expects argument of type ‘long unsigned int’, but argument 2 has type ‘int’ [-Wformat=]
OrdinaryDifferentialEquations.hsc:66:5: warning: format ‘%lu’ expects argument of type ‘long unsigned int’, but argument 2 has type ‘int’ [-Wformat=]
OrdinaryDifferentialEquations.hsc:66:5: warning: format ‘%lu’ expects argument of type ‘long unsigned int’, but argument 2 has type ‘int’ [-Wformat=]
OrdinaryDifferentialEquations.hsc:66:5: warning: format ‘%lu’ expects argument of type ‘long unsigned int’, but argument 2 has type ‘int’ [-Wformat=]
OrdinaryDifferentialEquations.hsc:91:5: warning: format ‘%lu’ expects argument of type ‘long unsigned int’, but argument 2 has type ‘int’ [-Wformat=]
OrdinaryDifferentialEquations.hsc:91:5: warning: format ‘%lu’ expects argument of type ‘long unsigned int’, but argument 2 has type ‘int’ [-Wformat=]
OrdinaryDifferentialEquations.hsc:91:5: warning: format ‘%lu’ expects argument of type ‘long unsigned int’, but argument 2 has type ‘int’ [-Wformat=]
Permutations.hsc: In function ‘main’:
Permutations.hsc:13:5: warning: format ‘%lu’ expects argument of type ‘long unsigned int’, but argument 2 has type ‘int’ [-Wformat=]
Permutations.hsc:13:5: warning: format ‘%lu’ expects argument of type ‘long unsigned int’, but argument 2 has type ‘int’ [-Wformat=]
Permutations.hsc:13:5: warning: format ‘%lu’ expects argument of type ‘long unsigned int’, but argument 2 has type ‘int’ [-Wformat=]
In file included from PhysicalConstants.hsc:1:0:
PhysicalConstants.hsc: In function ‘main’:
PhysicalConstants.hsc:31:21: error: ‘GSL_CONST_CGS_BOHR_MAGNETON’ undeclared (first use in this function)
/home/builder/hackage-server/build-cache/tmp-install/lib/x86_64-linux-ghc-8.0.1.20161018/bindings-DSL-1.0.23-GUrVdpTUVQC2JWoov2sGwA/include/bindings.dsl.h:86:51: note: in definition of macro ‘bc_float’
 #define bc_float(name) printf("%Le",(long double)(name)) \
                                                   ^
PhysicalConstants.hsc:31:5: note: in expansion of macro ‘hsc_fractional’
PhysicalConstants.hsc:31:21: note: each undeclared identifier is reported only once for each function it appears in
/home/builder/hackage-server/build-cache/tmp-install/lib/x86_64-linux-ghc-8.0.1.20161018/bindings-DSL-1.0.23-GUrVdpTUVQC2JWoov2sGwA/include/bindings.dsl.h:86:51: note: in definition of macro ‘bc_float’
 #define bc_float(name) printf("%Le",(long double)(name)) \
                                                   ^
PhysicalConstants.hsc:31:5: note: in expansion of macro ‘hsc_fractional’
PhysicalConstants.hsc:77:21: error: ‘GSL_CONST_CGS_ELECTRON_CHARGE’ undeclared (first use in this function)
/home/builder/hackage-server/build-cache/tmp-install/lib/x86_64-linux-ghc-8.0.1.20161018/bindings-DSL-1.0.23-GUrVdpTUVQC2JWoov2sGwA/include/bindings.dsl.h:86:51: note: in definition of macro ‘bc_float’
 #define bc_float(name) printf("%Le",(long double)(name)) \
                                                   ^
PhysicalConstants.hsc:77:5: note: in expansion of macro ‘hsc_fractional’
PhysicalConstants.hsc:81:21: error: ‘GSL_CONST_CGS_ELECTRON_MAGNETIC_MOMENT’ undeclared (first use in this function)
/home/builder/hackage-server/build-cache/tmp-install/lib/x86_64-linux-ghc-8.0.1.20161018/bindings-DSL-1.0.23-GUrVdpTUVQC2JWoov2sGwA/include/bindings.dsl.h:86:51: note: in definition of macro ‘bc_float’
 #define bc_float(name) printf("%Le",(long double)(name)) \
                                                   ^
PhysicalConstants.hsc:81:5: note: in expansion of macro ‘hsc_fractional’
PhysicalConstants.hsc:94:21: error: ‘GSL_CONST_CGS_FARADAY’ undeclared (first use in this function)
/home/builder/hackage-server/build-cache/tmp-install/lib/x86_64-linux-ghc-8.0.1.20161018/bindings-DSL-1.0.23-GUrVdpTUVQC2JWoov2sGwA/include/bindings.dsl.h:86:51: note: in definition of macro ‘bc_float’
 #define bc_float(name) printf("%Le",(long double)(name)) \
                                                   ^
PhysicalConstants.hsc:94:5: note: in expansion of macro ‘hsc_fractional’
PhysicalConstants.hsc:120:21: error: ‘GSL_CONST_CGS_GAUSS’ undeclared (first use in this function)
/home/builder/hackage-server/build-cache/tmp-install/lib/x86_64-linux-ghc-8.0.1.20161018/bindings-DSL-1.0.23-GUrVdpTUVQC2JWoov2sGwA/include/bindings.dsl.h:86:51: note: in definition of macro ‘bc_float’
 #define bc_float(name) printf("%Le",(long double)(name)) \
                                                   ^
PhysicalConstants.hsc:120:5: note: in expansion of macro ‘hsc_fractional’
PhysicalConstants.hsc:121:21: error: ‘GSL_CONST_CGSM_GAUSS’ undeclared (first use in this function)
/home/builder/hackage-server/build-cache/tmp-install/lib/x86_64-linux-ghc-8.0.1.20161018/bindings-DSL-1.0.23-GUrVdpTUVQC2JWoov2sGwA/include/bindings.dsl.h:86:51: note: in definition of macro ‘bc_float’
 #define bc_float(name) printf("%Le",(long double)(name)) \
                                                   ^
PhysicalConstants.hsc:121:5: note: in expansion of macro ‘hsc_fractional’
PhysicalConstants.hsc:258:21: error: ‘GSL_CONST_CGS_NUCLEAR_MAGNETON’ undeclared (first use in this function)
/home/builder/hackage-server/build-cache/tmp-install/lib/x86_64-linux-ghc-8.0.1.20161018/bindings-DSL-1.0.23-GUrVdpTUVQC2JWoov2sGwA/include/bindings.dsl.h:86:51: note: in definition of macro ‘bc_float’
 #define bc_float(name) printf("%Le",(long double)(name)) \
                                                   ^
PhysicalConstants.hsc:258:5: note: in expansion of macro ‘hsc_fractional’
PhysicalConstants.hsc:308:21: error: ‘GSL_CONST_CGS_PROTON_MAGNETIC_MOMENT’ undeclared (first use in this function)
/home/builder/hackage-server/build-cache/tmp-install/lib/x86_64-linux-ghc-8.0.1.20161018/bindings-DSL-1.0.23-GUrVdpTUVQC2JWoov2sGwA/include/bindings.dsl.h:86:51: note: in definition of macro ‘bc_float’
 #define bc_float(name) printf("%Le",(long double)(name)) \
                                                   ^
PhysicalConstants.hsc:308:5: note: in expansion of macro ‘hsc_fractional’
compiling dist/build/Bindings/Gsl/PhysicalConstants_hsc_make.c failed (exit code 1)
command was: /usr/bin/gcc -c dist/build/Bindings/Gsl/PhysicalConstants_hsc_make.c -o dist/build/Bindings/Gsl/PhysicalConstants_hsc_make.o -fno-stack-protector -fno-stack-protector -D__GLASGOW_HASKELL__=800 -Dlinux_BUILD_OS=1 -Dx86_64_BUILD_ARCH=1 -Dlinux_HOST_OS=1 -Dx86_64_HOST_ARCH=1 -Idist/build/autogen -include dist/build/autogen/cabal_macros.h -I/home/builder/hackage-server/build-cache/tmp-install/lib/x86_64-linux-ghc-8.0.1.20161018/bindings-DSL-1.0.23-GUrVdpTUVQC2JWoov2sGwA/include -I/opt/ghc/8.0.2/lib/ghc-8.0.1.20161018/base-4.9.0.0/include -I/opt/ghc/8.0.2/lib/ghc-8.0.1.20161018/integer-gmp-1.0.0.1/include -I/opt/ghc/8.0.2/lib/ghc-8.0.1.20161018/include -I/opt/ghc/8.0.2/lib/ghc-8.0.1.20161018/include/
cabal: Leaving directory '/tmp/cabal-tmp-664/bindings-gsl-0.1.1'
cabal: Error: some packages failed to install:
bindings-gsl-0.1.1 failed during the building phase. The exception was:
ExitFailure 1