Build #6 for intricacy-0.5.5

[all reports]

Package intricacy-0.5.5
Install DependencyFailed SDL-gfx-0.6.0.2
Docs NotTried
Tests NotTried
Time submitted 2016-12-08 21:26:40.572046 UTC
Compiler ghc-8.0.1.20161018
OS linux
Arch x86_64
Dependencies SDL-0.6.5.1, SDL-gfx-0.6.0.2, SDL-mixer-0.6.2.0, SDL-ttf-0.6.2.2, array-0.5.1.1, base-4.9.0.0, binary-0.8.3.0, bytestring-0.10.8.1, containers-0.5.7.1, cryptohash-0.11.9, directory-1.2.6.2, filepath-1.4.1.0, hscurses-1.4.2.0, mtl-2.2.1, network-fancy-0.2.4, random-1.1, safe-0.3.10, stm-2.4.4.1, time-1.6.0.1, transformers-0.5.2.0, vector-0.11.0.0
Flags sound -server sdl game curses

Code Coverage

No Code Coverage was submitted for this report.

Build log

[view raw]

Resolving dependencies...
Configuring SDL-0.6.5.1...
Configuring byteable-0.1.1...
Building byteable-0.1.1...
Installed byteable-0.1.1
Configuring memory-0.13...
Building memory-0.13...
Building SDL-0.6.5.1...
Configuring network-fancy-0.2.4...
Installed memory-0.13
Building network-fancy-0.2.4...
Configuring mtl-2.2.1...
Installed SDL-0.6.5.1
Configuring primitive-0.6.1.0...
Installed network-fancy-0.2.4
Building mtl-2.2.1...
Building primitive-0.6.1.0...
Configuring old-locale-1.0.0.7...
Installed mtl-2.2.1
Building old-locale-1.0.0.7...
Configuring random-1.1...
Installed primitive-0.6.1.0
Building random-1.1...
Configuring stm-2.4.4.1...
Installed old-locale-1.0.0.7
Building stm-2.4.4.1...
Configuring safe-0.3.10...
Installed random-1.1
Building safe-0.3.10...
Configuring transformers-compat-0.5.1.4...
Installed stm-2.4.4.1
Building transformers-compat-0.5.1.4...
Installed safe-0.3.10
Configuring cryptonite-0.20...
Configuring SDL-gfx-0.6.0.2...
Installed transformers-compat-0.5.1.4
Building cryptonite-0.20...
Configuring SDL-mixer-0.6.2.0...
Failed to install SDL-gfx-0.6.0.2
Build log ( /home/builder/.cabal/logs/SDL-gfx-0.6.0.2.log ):
cabal: Entering directory '/tmp/cabal-tmp-21184/SDL-gfx-0.6.0.2'
[1 of 1] Compiling Main             ( /tmp/cabal-tmp-21184/SDL-gfx-0.6.0.2/dist/setup/setup.hs, /tmp/cabal-tmp-21184/SDL-gfx-0.6.0.2/dist/setup/Main.o )
Linking /tmp/cabal-tmp-21184/SDL-gfx-0.6.0.2/dist/setup/setup ...
Configuring SDL-gfx-0.6.0.2...
checking for sdl-config... /usr/bin/sdl-config
checking for gcc... /usr/bin/gcc
checking for C compiler default output file name... a.out
checking whether the C compiler works... yes
checking whether we are cross compiling... no
checking for suffix of executables... 
checking for suffix of object files... o
checking whether we are using the GNU C compiler... yes
checking whether /usr/bin/gcc accepts -g... yes
checking for /usr/bin/gcc option to accept ISO C89... none needed
checking for SDL_initFramerate in -lSDL_gfx... no
configure: error: *** SDL_gfx lib not found! Get SDL_gfx from
http://www.ferzkopp.net/~aschiffler/Software/SDL_gfx-2.0/
cabal: Leaving directory '/tmp/cabal-tmp-21184/SDL-gfx-0.6.0.2'
Configuring SDL-ttf-0.6.2.2...
Failed to install SDL-mixer-0.6.2.0
Build log ( /home/builder/.cabal/logs/SDL-mixer-0.6.2.0.log ):
cabal: Entering directory '/tmp/cabal-tmp-21186/SDL-mixer-0.6.2.0'
[1 of 1] Compiling Main             ( /tmp/cabal-tmp-21186/SDL-mixer-0.6.2.0/dist/setup/setup.hs, /tmp/cabal-tmp-21186/SDL-mixer-0.6.2.0/dist/setup/Main.o )
Linking /tmp/cabal-tmp-21186/SDL-mixer-0.6.2.0/dist/setup/setup ...
Configuring SDL-mixer-0.6.2.0...
configure: WARNING: unrecognized options: --with-compiler
checking for sdl-config... /usr/bin/sdl-config
checking for gcc... /usr/bin/gcc
checking whether the C compiler works... no
configure: error: in `/tmp/cabal-tmp-21186/SDL-mixer-0.6.2.0':
configure: error: C compiler cannot create executables
See `config.log' for more details.
cabal: Leaving directory '/tmp/cabal-tmp-21186/SDL-mixer-0.6.2.0'
Configuring vector-0.11.0.0...
Failed to install SDL-ttf-0.6.2.2
Build log ( /home/builder/.cabal/logs/SDL-ttf-0.6.2.2.log ):
cabal: Entering directory '/tmp/cabal-tmp-21195/SDL-ttf-0.6.2.2'
[1 of 1] Compiling Main             ( /tmp/cabal-tmp-21195/SDL-ttf-0.6.2.2/dist/setup/setup.hs, /tmp/cabal-tmp-21195/SDL-ttf-0.6.2.2/dist/setup/Main.o )
Linking /tmp/cabal-tmp-21195/SDL-ttf-0.6.2.2/dist/setup/setup ...
Configuring SDL-ttf-0.6.2.2...
checking for sdl-config... /usr/bin/sdl-config
checking for gcc... /usr/bin/gcc
checking for C compiler default output file name... a.out
checking whether the C compiler works... yes
checking whether we are cross compiling... no
checking for suffix of executables... 
checking for suffix of object files... o
checking whether we are using the GNU C compiler... yes
checking whether /usr/bin/gcc accepts -g... yes
checking for /usr/bin/gcc option to accept ISO C89... none needed
checking for TTF_OpenFont in -lSDL_ttf... no
configure: error: *** SDL_ttf lib not found! Get SDL_ttf from
http://www.libsdl.org/projects/SDL_ttf/index.html
cabal: Leaving directory '/tmp/cabal-tmp-21195/SDL-ttf-0.6.2.2'
Building vector-0.11.0.0...
Configuring old-time-1.1.0.3...
Installed cryptonite-0.20
Building old-time-1.1.0.3...
Installed vector-0.11.0.0
Configuring exceptions-0.8.3...
Building exceptions-0.8.3...
Configuring cryptohash-0.11.9...
Installed old-time-1.1.0.3
Building cryptohash-0.11.9...
Installed exceptions-0.8.3
Configuring hscurses-1.4.2.0...
Building hscurses-1.4.2.0...
Installed cryptohash-0.11.9
Installed hscurses-1.4.2.0
cabal: Error: some packages failed to install:
SDL-gfx-0.6.0.2 failed during the configure step. The exception was:
ExitFailure 1
SDL-mixer-0.6.2.0 failed during the configure step. The exception was:
ExitFailure 77
SDL-ttf-0.6.2.2 failed during the configure step. The exception was:
ExitFailure 1
intricacy-0.5.5 depends on SDL-gfx-0.6.0.2 which failed to install.

Test log

No test log was submitted for this report.