Build #16 for HTicTacToe-0.2

[all reports]

Package HTicTacToe-0.2
Install DependencyFailed SDL-image-0.6.1.2
Docs NotTried
Tests NotTried
Time submitted 2016-10-25 15:12:33.953211 UTC
Compiler ghc-8.0.1.20160701
OS linux
Arch x86_64
Dependencies SDL-0.6.5.1, SDL-image-0.6.1.2, SDL-ttf-0.6.2.2, array-0.5.1.1, base-4.9.0.0, mtl-2.2.1, random-1.1
Flags none

Build log

[view raw]

Resolving dependencies...
cabal: Entering directory '/tmp/cabal-tmp-15297/SDL-0.6.5.1'
[1 of 1] Compiling Main             ( /tmp/cabal-tmp-15297/SDL-0.6.5.1/dist/setup/setup.hs, /tmp/cabal-tmp-15297/SDL-0.6.5.1/dist/setup/Main.o )
Linking /tmp/cabal-tmp-15297/SDL-0.6.5.1/dist/setup/setup ...
Configuring SDL-0.6.5.1...
configure: WARNING: unrecognized options: --with-compiler
checking for sdl-config... /usr/bin/sdl-config
configure: creating ./config.status
config.status: creating config.mk
config.status: creating SDL.buildinfo
config.status: creating includes/HsSDLConfig.h
configure: WARNING: unrecognized options: --with-compiler
Building SDL-0.6.5.1...
Preprocessing library SDL-0.6.5.1...
[ 1 of 16] Compiling Graphics.UI.SDL.Utilities ( Graphics/UI/SDL/Utilities.hs, dist/build/Graphics/UI/SDL/Utilities.o )
[ 2 of 16] Compiling Graphics.UI.SDL.CPUInfo ( Graphics/UI/SDL/CPUInfo.hs, dist/build/Graphics/UI/SDL/CPUInfo.o )
[ 3 of 16] Compiling Graphics.UI.SDL.Version ( dist/build/Graphics/UI/SDL/Version.hs, dist/build/Graphics/UI/SDL/Version.o )

Graphics/UI/SDL/Version.hsc:17:10: warning: [-Wmissing-methods]
    • No explicit implementation for
        either ‘Foreign.Storable.poke’
               or
               ‘Foreign.Storable.pokeElemOff’
               or
               ‘Foreign.Storable.pokeByteOff’
    • In the instance declaration for ‘Storable SDLVersion’
[ 4 of 16] Compiling Graphics.UI.SDL.Keysym ( dist/build/Graphics/UI/SDL/Keysym.hs, dist/build/Graphics/UI/SDL/Keysym.o )
[ 5 of 16] Compiling Graphics.UI.SDL.Color ( Graphics/UI/SDL/Color.hs, dist/build/Graphics/UI/SDL/Color.o )
[ 6 of 16] Compiling Graphics.UI.SDL.Audio ( dist/build/Graphics/UI/SDL/Audio.hs, dist/build/Graphics/UI/SDL/Audio.o )
[ 7 of 16] Compiling Graphics.UI.SDL.Types ( dist/build/Graphics/UI/SDL/Types.hs, dist/build/Graphics/UI/SDL/Types.o )
[ 8 of 16] Compiling Graphics.UI.SDL.Time ( Graphics/UI/SDL/Time.hs, dist/build/Graphics/UI/SDL/Time.o )
[ 9 of 16] Compiling Graphics.UI.SDL.Rect ( dist/build/Graphics/UI/SDL/Rect.hs, dist/build/Graphics/UI/SDL/Rect.o )
[10 of 16] Compiling Graphics.UI.SDL.General ( dist/build/Graphics/UI/SDL/General.hs, dist/build/Graphics/UI/SDL/General.o )
[11 of 16] Compiling Graphics.UI.SDL.WindowManagement ( dist/build/Graphics/UI/SDL/WindowManagement.hs, dist/build/Graphics/UI/SDL/WindowManagement.o )
[12 of 16] Compiling Graphics.UI.SDL.RWOps ( Graphics/UI/SDL/RWOps.hs, dist/build/Graphics/UI/SDL/RWOps.o )
[13 of 16] Compiling Graphics.UI.SDL.Video ( dist/build/Graphics/UI/SDL/Video.hs, dist/build/Graphics/UI/SDL/Video.o )
[14 of 16] Compiling Graphics.UI.SDL.Events ( dist/build/Graphics/UI/SDL/Events.hs, dist/build/Graphics/UI/SDL/Events.o )
[15 of 16] Compiling Graphics.UI.SDL.Joystick ( dist/build/Graphics/UI/SDL/Joystick.hs, dist/build/Graphics/UI/SDL/Joystick.o )
[16 of 16] Compiling Graphics.UI.SDL  ( Graphics/UI/SDL.hs, dist/build/Graphics/UI/SDL.o )
Running Haddock for SDL-0.6.5.1...
Running hscolour for SDL-0.6.5.1...
Preprocessing library SDL-0.6.5.1...
Preprocessing library SDL-0.6.5.1...

Graphics/UI/SDL/Version.hsc:17:10: warning: [-Wmissing-methods]
    • No explicit implementation for
        either ‘Foreign.Storable.poke’
               or
               ‘Foreign.Storable.pokeElemOff’
               or
               ‘Foreign.Storable.pokeByteOff’
    • In the instance declaration for ‘Storable SDLVersion’
Haddock coverage:
  14% (  1 /  7) in 'Graphics.UI.SDL.Utilities'
  Missing documentation for:
    Enum (Graphics/UI/SDL/Utilities.hs:20)
    intToBool (Graphics/UI/SDL/Utilities.hs:29)
    toBitmask (Graphics/UI/SDL/Utilities.hs:33)
    fromBitmask (Graphics/UI/SDL/Utilities.hs:36)
    fromCInt (Graphics/UI/SDL/Utilities.hs:57)
    toCInt (Graphics/UI/SDL/Utilities.hs:60)
  89% (  8 /  9) in 'Graphics.UI.SDL.CPUInfo'
  Missing documentation for:
    Module header
   0% (  0 /  3) in 'Graphics.UI.SDL.Version'
  Missing documentation for:
    Module header
    compiledFor (Graphics/UI/SDL/Version.hsc:25)
    linkedWith (Graphics/UI/SDL/Version.hsc:33)
  11% (  1 /  9) in 'Graphics.UI.SDL.Keysym'
  Missing documentation for:
    Keysym (Graphics/UI/SDL/Keysym.hsc:25)
     (Graphics/UI/SDL/Keysym.hsc:32)
    Modifier (Graphics/UI/SDL/Keysym.hsc:46)
     (Graphics/UI/SDL/Keysym.hsc:63)
     (Graphics/UI/SDL/Keysym.hsc:66)
    SDLKey (Graphics/UI/SDL/Keysym.hsc:136)
     (Graphics/UI/SDL/Keysym.hsc:371)
     (Graphics/UI/SDL/Keysym.hsc:374)
  33% (  1 /  3) in 'Graphics.UI.SDL.Color'
  Missing documentation for:
    Color (Graphics/UI/SDL/Color.hs:21)
    Pixel (Graphics/UI/SDL/Color.hs:35)
  25% (  1 /  4) in 'Graphics.UI.SDL.Audio'
  Missing documentation for:
    AudioFormat (Graphics/UI/SDL/Audio.hsc:24)
    fromAudioFormat (Graphics/UI/SDL/Audio.hsc:35)
    toAudioFormat (Graphics/UI/SDL/Audio.hsc:45)
   4% (  1 / 26) in 'Graphics.UI.SDL.Types'
  Missing documentation for:
    SurfaceStruct (Graphics/UI/SDL/Types.hsc:54)
    Surface (Graphics/UI/SDL/Types.hsc:55)
    VideoInfoStruct (Graphics/UI/SDL/Types.hsc:57)
    VideoInfo (Graphics/UI/SDL/Types.hsc:58)
    RWopsStruct (Graphics/UI/SDL/Types.hsc:60)
    RWops (Graphics/UI/SDL/Types.hsc:61)
    PixelFormatStruct (Graphics/UI/SDL/Types.hsc:63)
    PixelFormat (Graphics/UI/SDL/Types.hsc:64)
    JoystickStruct (Graphics/UI/SDL/Types.hsc:71)
    Joystick (Graphics/UI/SDL/Types.hsc:72)
    Hat (Graphics/UI/SDL/Types.hsc:74)
    TimerIDStruct (Graphics/UI/SDL/Types.hsc:66)
    SurfaceFlag (Graphics/UI/SDL/Types.hsc:133)
    surfaceGetPixelFormat (Graphics/UI/SDL/Types.hsc:227)
    surfaceGetWidth (Graphics/UI/SDL/Types.hsc:257)
    surfaceGetHeight (Graphics/UI/SDL/Types.hsc:263)
    surfaceGetFlags (Graphics/UI/SDL/Types.hsc:269)
    surfaceGetPitch (Graphics/UI/SDL/Types.hsc:274)
    surfaceGetPixels (Graphics/UI/SDL/Types.hsc:280)
    pixelFormatGetAlpha (Graphics/UI/SDL/Types.hsc:233)
    pixelFormatGetColorKey (Graphics/UI/SDL/Types.hsc:238)
    pixelFormatGetBitsPerPixel (Graphics/UI/SDL/Types.hsc:244)
    pixelFormatGetBytesPerPixel (Graphics/UI/SDL/Types.hsc:249)
    videoInfoWidth (Graphics/UI/SDL/Types.hsc:285)
    videoInfoHeight (Graphics/UI/SDL/Types.hsc:291)
  33% (  1 /  3) in 'Graphics.UI.SDL.Time'
  Missing documentation for:
    getTicks (Graphics/UI/SDL/Time.hs:18)
    delay (Graphics/UI/SDL/Time.hs:21)
  33% (  1 /  3) in 'Graphics.UI.SDL.Rect'
  Missing documentation for:
    Rect (Graphics/UI/SDL/Rect.hsc:23)
     (Graphics/UI/SDL/Rect.hsc:29)
  38% (  5 / 13) in 'Graphics.UI.SDL.General'
  Missing documentation for:
    withInit (Graphics/UI/SDL/General.hsc:122)
    quitSubSystem (Graphics/UI/SDL/General.hsc:135)
    quit (Graphics/UI/SDL/General.hsc:139)
    failWithError (Graphics/UI/SDL/General.hsc:159)
    unwrapBool (Graphics/UI/SDL/General.hsc:108)
    unwrapMaybe (Graphics/UI/SDL/General.hsc:94)
    unwrapInt (Graphics/UI/SDL/General.hsc:101)
    InitFlag (Graphics/UI/SDL/General.hsc:43)
  90% (  9 / 10) in 'Graphics.UI.SDL.WindowManagement'
  Missing documentation for:
    GrabMode (Graphics/UI/SDL/WindowManagement.hsc:37)
  17% (  1 /  6) in 'Graphics.UI.SDL.RWOps'
  Missing documentation for:
    fromFile (Graphics/UI/SDL/RWOps.hs:48)
    tryFromFile (Graphics/UI/SDL/RWOps.hs:42)
    free (Graphics/UI/SDL/RWOps.hs:56)
    with (Graphics/UI/SDL/RWOps.hs:33)
    mkFinalizedRW (Graphics/UI/SDL/RWOps.hs:53)
  58% ( 46 / 80) in 'Graphics.UI.SDL.Video'
  Missing documentation for:
    Palette (Graphics/UI/SDL/Video.hsc:106)
    Toggle (Graphics/UI/SDL/Video.hsc:130)
    fromToggle (Graphics/UI/SDL/Video.hsc:139)
    toToggle (Graphics/UI/SDL/Video.hsc:133)
    getVideoInfo (Graphics/UI/SDL/Video.hsc:168)
    ListModes (Graphics/UI/SDL/Video.hsc:171)
    setGamma (Graphics/UI/SDL/Video.hsc:294)
    tryGetGammaRamp (Graphics/UI/SDL/Video.hsc:300)
    getGammaRamp (Graphics/UI/SDL/Video.hsc:312)
    trySetGammaRamp (Graphics/UI/SDL/Video.hsc:317)
    setGammaRamp (Graphics/UI/SDL/Video.hsc:326)
    tryCreateRGBSurfaceFrom (Graphics/UI/SDL/Video.hsc:426)
    createRGBSurfaceFrom (Graphics/UI/SDL/Video.hsc:432)
    loadBMP (Graphics/UI/SDL/Video.hsc:485)
    saveBMP (Graphics/UI/SDL/Video.hsc:500)
    setColorKey (Graphics/UI/SDL/Video.hsc:508)
    GLAttr (Graphics/UI/SDL/Video.hsc:645)
    GLValue (Graphics/UI/SDL/Video.hsc:646)
    glRedSize (Graphics/UI/SDL/Video.hsc:648)
    glGreenSize (Graphics/UI/SDL/Video.hsc:648)
    glBlueSize (Graphics/UI/SDL/Video.hsc:648)
    glAlphaSize (Graphics/UI/SDL/Video.hsc:648)
    glBufferSize (Graphics/UI/SDL/Video.hsc:648)
    glDoubleBuffer (Graphics/UI/SDL/Video.hsc:648)
    glDepthSize (Graphics/UI/SDL/Video.hsc:649)
    glStencilSize (Graphics/UI/SDL/Video.hsc:649)
    glAccumRedSize (Graphics/UI/SDL/Video.hsc:649)
    glAccumGreenSize (Graphics/UI/SDL/Video.hsc:649)
    glAccumBlueSize (Graphics/UI/SDL/Video.hsc:649)
    glAccumAlphaSize (Graphics/UI/SDL/Video.hsc:650)
    glStereo (Graphics/UI/SDL/Video.hsc:650)
    glMultiSampleBuffers (Graphics/UI/SDL/Video.hsc:650)
    glMultiSampleSamples (Graphics/UI/SDL/Video.hsc:650)
    mkFinalizedSurface (Graphics/UI/SDL/Video.hsc:700)
  93% ( 25 / 27) in 'Graphics.UI.SDL.Events'
  Missing documentation for:
    MouseButton (Graphics/UI/SDL/Events.hsc:167)
    Focus (Graphics/UI/SDL/Events.hsc:215)
 100% ( 18 / 18) in 'Graphics.UI.SDL.Joystick'
 100% ( 14 / 14) in 'Graphics.UI.SDL'
Warning: Graphics.UI.SDL.Types: could not find link destinations for:
    Pixels
Warning: Graphics.UI.SDL.Events: could not find link destinations for:
    SafePtr
Warning: Graphics.UI.SDL.Joystick: could not find link destinations for:
    JoystickIndex
Documentation created: dist/doc/html/SDL/index.html, dist/doc/html/SDL/SDL.txt
Creating package registration file:
/tmp/pkgConf-SDL-0.6.510252023621350490027.1
Installing library in
/home/builder/hackage-server/build-cache/tmp-install/lib/x86_64-linux-ghc-8.0.1.20160701/SDL-0.6.5.1-LoCqIQ8pzTI920Lhhw36PE
Registering SDL-0.6.5.1...
cabal: Leaving directory '/tmp/cabal-tmp-15297/SDL-0.6.5.1'
Installed SDL-0.6.5.1
cabal: Entering directory '/tmp/cabal-tmp-15297/mtl-2.2.1'
Configuring mtl-2.2.1...
Building mtl-2.2.1...
Preprocessing library mtl-2.2.1...
[ 1 of 22] Compiling Control.Monad.Writer.Class ( Control/Monad/Writer/Class.hs, dist/build/Control/Monad/Writer/Class.o )
[ 2 of 22] Compiling Control.Monad.State.Class ( Control/Monad/State/Class.hs, dist/build/Control/Monad/State/Class.o )
[ 3 of 22] Compiling Control.Monad.Reader.Class ( Control/Monad/Reader/Class.hs, dist/build/Control/Monad/Reader/Class.o )
[ 4 of 22] Compiling Control.Monad.RWS.Class ( Control/Monad/RWS/Class.hs, dist/build/Control/Monad/RWS/Class.o )
[ 5 of 22] Compiling Control.Monad.Identity ( Control/Monad/Identity.hs, dist/build/Control/Monad/Identity.o )
[ 6 of 22] Compiling Control.Monad.Error.Class ( Control/Monad/Error/Class.hs, dist/build/Control/Monad/Error/Class.o )
[ 7 of 22] Compiling Control.Monad.Cont.Class ( Control/Monad/Cont/Class.hs, dist/build/Control/Monad/Cont/Class.o )
[ 8 of 22] Compiling Control.Monad.Trans ( Control/Monad/Trans.hs, dist/build/Control/Monad/Trans.o )
[ 9 of 22] Compiling Control.Monad.Error ( Control/Monad/Error.hs, dist/build/Control/Monad/Error.o )
[10 of 22] Compiling Control.Monad.Except ( Control/Monad/Except.hs, dist/build/Control/Monad/Except.o )
[11 of 22] Compiling Control.Monad.List ( Control/Monad/List.hs, dist/build/Control/Monad/List.o )
[12 of 22] Compiling Control.Monad.RWS.Lazy ( Control/Monad/RWS/Lazy.hs, dist/build/Control/Monad/RWS/Lazy.o )
[13 of 22] Compiling Control.Monad.RWS ( Control/Monad/RWS.hs, dist/build/Control/Monad/RWS.o )
[14 of 22] Compiling Control.Monad.Reader ( Control/Monad/Reader.hs, dist/build/Control/Monad/Reader.o )
[15 of 22] Compiling Control.Monad.RWS.Strict ( Control/Monad/RWS/Strict.hs, dist/build/Control/Monad/RWS/Strict.o )
[16 of 22] Compiling Control.Monad.State.Lazy ( Control/Monad/State/Lazy.hs, dist/build/Control/Monad/State/Lazy.o )
[17 of 22] Compiling Control.Monad.State ( Control/Monad/State.hs, dist/build/Control/Monad/State.o )
[18 of 22] Compiling Control.Monad.State.Strict ( Control/Monad/State/Strict.hs, dist/build/Control/Monad/State/Strict.o )
[19 of 22] Compiling Control.Monad.Writer.Lazy ( Control/Monad/Writer/Lazy.hs, dist/build/Control/Monad/Writer/Lazy.o )
[20 of 22] Compiling Control.Monad.Writer ( Control/Monad/Writer.hs, dist/build/Control/Monad/Writer.o )
[21 of 22] Compiling Control.Monad.Writer.Strict ( Control/Monad/Writer/Strict.hs, dist/build/Control/Monad/Writer/Strict.o )
[22 of 22] Compiling Control.Monad.Cont ( Control/Monad/Cont.hs, dist/build/Control/Monad/Cont.o )
Running Haddock for mtl-2.2.1...
Running hscolour for mtl-2.2.1...
Preprocessing library mtl-2.2.1...
Preprocessing library mtl-2.2.1...
Haddock coverage:
  75% (  3 /  4) in 'Control.Monad.Writer.Class'
  Missing documentation for:
    MonadWriter (Control/Monad/Writer/Class.hs:62)
 100% (  5 /  5) in 'Control.Monad.State.Class'
 100% (  3 /  3) in 'Control.Monad.Reader.Class'
  80% (  4 /  5) in 'Control.Monad.RWS.Class'
  Missing documentation for:
    MonadRWS (Control/Monad/RWS/Class.hs:44)
 100% (  4 /  4) in 'Control.Monad.Identity'
 100% (  3 /  3) in 'Control.Monad.Error.Class'
  50% (  1 /  2) in 'Control.Monad.Cont.Class'
  Missing documentation for:
    MonadCont (Control/Monad/Cont/Class.hs:73)
 100% (  3 /  3) in 'Control.Monad.Trans'
  93% ( 14 / 15) in 'Control.Monad.Error'
  Missing documentation for:
    runErrorT
 100% ( 19 / 19) in 'Control.Monad.Except'
 100% (  5 /  5) in 'Control.Monad.List'
  95% ( 21 / 22) in 'Control.Monad.RWS.Lazy'
  Missing documentation for:
    runRWST
 100% (  2 /  2) in 'Control.Monad.RWS'
  96% ( 22 / 23) in 'Control.Monad.Reader'
  Missing documentation for:
    runReaderT
  95% ( 21 / 22) in 'Control.Monad.RWS.Strict'
  Missing documentation for:
    runRWST
  96% ( 24 / 25) in 'Control.Monad.State.Lazy'
  Missing documentation for:
    runStateT
 100% (  2 /  2) in 'Control.Monad.State'
  96% ( 24 / 25) in 'Control.Monad.State.Strict'
  Missing documentation for:
    runStateT
  89% ( 17 / 19) in 'Control.Monad.Writer.Lazy'
  Missing documentation for:
    MonadWriter (Control/Monad/Writer/Class.hs:62)
    runWriterT
 100% (  2 /  2) in 'Control.Monad.Writer'
  94% ( 17 / 18) in 'Control.Monad.Writer.Strict'
  Missing documentation for:
    MonadWriter (Control/Monad/Writer/Class.hs:62)
  91% ( 20 / 22) in 'Control.Monad.Cont'
  Missing documentation for:
    MonadCont (Control/Monad/Cont/Class.hs:73)
    runContT
Documentation created: dist/doc/html/mtl/index.html, dist/doc/html/mtl/mtl.txt
Creating package registration file: /tmp/pkgConf-mtl-2.213691330691125898167.1
Installing library in
/home/builder/hackage-server/build-cache/tmp-install/lib/x86_64-linux-ghc-8.0.1.20160701/mtl-2.2.1-6qsR1PHUy5lL47Hpoa4jCM
Registering mtl-2.2.1...
cabal: Leaving directory '/tmp/cabal-tmp-15297/mtl-2.2.1'
Installed mtl-2.2.1
cabal: Entering directory '/tmp/cabal-tmp-15297/random-1.1'
Configuring random-1.1...
Building random-1.1...
Preprocessing library random-1.1...
[1 of 1] Compiling System.Random    ( System/Random.hs, dist/build/System/Random.o )

System/Random.hs:43:1: warning: [-Wtabs]
    Tab character found here, and in 74 further locations.
    Please use spaces instead.
Running Haddock for random-1.1...
Running hscolour for random-1.1...
Preprocessing library random-1.1...
Preprocessing library random-1.1...

System/Random.hs:43:1: warning: [-Wtabs]
    Tab character found here, and in 74 further locations.
    Please use spaces instead.
Haddock coverage:
Cannot find documentation for: $intro
 100% ( 16 / 16) in 'System.Random'
Documentation created: dist/doc/html/random/index.html,
dist/doc/html/random/random.txt
Creating package registration file:
/tmp/pkgConf-random-118963066401343606042.1
Installing library in
/home/builder/hackage-server/build-cache/tmp-install/lib/x86_64-linux-ghc-8.0.1.20160701/random-1.1-54KmMHXjttlERYcr1mvsAe
Registering random-1.1...
cabal: Leaving directory '/tmp/cabal-tmp-15297/random-1.1'
Installed random-1.1
cabal: Entering directory '/tmp/cabal-tmp-15297/SDL-image-0.6.1.2'
[1 of 1] Compiling Main             ( /tmp/cabal-tmp-15297/SDL-image-0.6.1.2/dist/setup/setup.hs, /tmp/cabal-tmp-15297/SDL-image-0.6.1.2/dist/setup/Main.o )
Linking /tmp/cabal-tmp-15297/SDL-image-0.6.1.2/dist/setup/setup ...
Configuring SDL-image-0.6.1.2...
configure: WARNING: unrecognized options: --with-compiler
checking for sdl-config... /usr/bin/sdl-config
checking for gcc... /usr/bin/gcc
checking whether the C compiler works... no
configure: error: in `/tmp/cabal-tmp-15297/SDL-image-0.6.1.2':
configure: error: C compiler cannot create executables
See `config.log' for more details.
cabal: Leaving directory '/tmp/cabal-tmp-15297/SDL-image-0.6.1.2'
Failed to install SDL-image-0.6.1.2
cabal: Entering directory '/tmp/cabal-tmp-15297/SDL-ttf-0.6.2.2'
[1 of 1] Compiling Main             ( /tmp/cabal-tmp-15297/SDL-ttf-0.6.2.2/dist/setup/setup.hs, /tmp/cabal-tmp-15297/SDL-ttf-0.6.2.2/dist/setup/Main.o )
Linking /tmp/cabal-tmp-15297/SDL-ttf-0.6.2.2/dist/setup/setup ...
Configuring SDL-ttf-0.6.2.2...
checking for sdl-config... /usr/bin/sdl-config
checking for gcc... /usr/bin/gcc
checking for C compiler default output file name... a.out
checking whether the C compiler works... yes
checking whether we are cross compiling... no
checking for suffix of executables... 
checking for suffix of object files... o
checking whether we are using the GNU C compiler... yes
checking whether /usr/bin/gcc accepts -g... yes
checking for /usr/bin/gcc option to accept ISO C89... none needed
checking for TTF_OpenFont in -lSDL_ttf... no
configure: error: *** SDL_ttf lib not found! Get SDL_ttf from
http://www.libsdl.org/projects/SDL_ttf/index.html
cabal: Leaving directory '/tmp/cabal-tmp-15297/SDL-ttf-0.6.2.2'
Failed to install SDL-ttf-0.6.2.2
cabal: Error: some packages failed to install:
HTicTacToe-0.2 depends on SDL-image-0.6.1.2 which failed to install.
SDL-image-0.6.1.2 failed during the configure step. The exception was:
ExitFailure 77
SDL-ttf-0.6.2.2 failed during the configure step. The exception was:
ExitFailure 1