Build #10 for Raincat-1.1.1.2

[all reports]

Package Raincat-1.1.1.2
Install DependencyFailed SDL-image-0.6.1.2
Docs NotTried
Tests NotTried
Time submitted 2016-12-29 15:39:47.812 UTC
Compiler ghc-8.0.1.20161018
OS linux
Arch x86_64
Dependencies GLUT-2.7.0.10, OpenGL-3.0.1.0, SDL-0.6.5.1, SDL-image-0.6.1.2, SDL-mixer-0.6.2.0, base-4.9.0.0, containers-0.5.7.1, extensible-exceptions-0.1.1.4, mtl-2.2.1, random-1.1, time-1.6.0.1
Flags none

Build log

[view raw]

Resolving dependencies...
Configuring ObjectName-1.1.0.1...
Configuring SDL-0.6.5.1...
Building ObjectName-1.1.0.1...
Installed ObjectName-1.1.0.1
Configuring fixed-0.2.1.1...
Building fixed-0.2.1.1...
Configuring extensible-exceptions-0.1.1.4...
Installed fixed-0.2.1.1
Building SDL-0.6.5.1...
Building extensible-exceptions-0.1.1.4...
Configuring half-0.2.2.3...
Installed extensible-exceptions-0.1.1.4
Building half-0.2.2.3...
Configuring random-1.1...
Installed half-0.2.2.3
Building random-1.1...
Configuring mtl-2.2.1...
Installed random-1.1
Building mtl-2.2.1...
Configuring stm-2.4.4.1...
Installed SDL-0.6.5.1
Building stm-2.4.4.1...
Configuring text-1.2.2.1...
Installed mtl-2.2.1
Installed stm-2.4.4.1
Configuring SDL-image-0.6.1.2...
Building text-1.2.2.1...
Configuring SDL-mixer-0.6.2.0...
Failed to install SDL-image-0.6.1.2
Build log ( /home/builder/.cabal/logs/SDL-image-0.6.1.2.log ):
cabal: Entering directory '/tmp/cabal-tmp-11172/SDL-image-0.6.1.2'
[1 of 1] Compiling Main             ( /tmp/cabal-tmp-11172/SDL-image-0.6.1.2/dist/setup/setup.hs, /tmp/cabal-tmp-11172/SDL-image-0.6.1.2/dist/setup/Main.o )
Linking /tmp/cabal-tmp-11172/SDL-image-0.6.1.2/dist/setup/setup ...
Configuring SDL-image-0.6.1.2...
configure: WARNING: unrecognized options: --with-compiler
checking for sdl-config... /usr/bin/sdl-config
checking for gcc... /usr/bin/gcc
checking whether the C compiler works... no
configure: error: in `/tmp/cabal-tmp-11172/SDL-image-0.6.1.2':
configure: error: C compiler cannot create executables
See `config.log' for more details.
cabal: Leaving directory '/tmp/cabal-tmp-11172/SDL-image-0.6.1.2'
Configuring StateVar-1.1.0.4...
Failed to install SDL-mixer-0.6.2.0
Build log ( /home/builder/.cabal/logs/SDL-mixer-0.6.2.0.log ):
cabal: Entering directory '/tmp/cabal-tmp-11173/SDL-mixer-0.6.2.0'
[1 of 1] Compiling Main             ( /tmp/cabal-tmp-11173/SDL-mixer-0.6.2.0/dist/setup/setup.hs, /tmp/cabal-tmp-11173/SDL-mixer-0.6.2.0/dist/setup/Main.o )
Linking /tmp/cabal-tmp-11173/SDL-mixer-0.6.2.0/dist/setup/setup ...
Configuring SDL-mixer-0.6.2.0...
configure: WARNING: unrecognized options: --with-compiler
checking for sdl-config... /usr/bin/sdl-config
checking for gcc... /usr/bin/gcc
checking whether the C compiler works... no
configure: error: in `/tmp/cabal-tmp-11173/SDL-mixer-0.6.2.0':
configure: error: C compiler cannot create executables
See `config.log' for more details.
cabal: Leaving directory '/tmp/cabal-tmp-11173/SDL-mixer-0.6.2.0'
Building StateVar-1.1.0.4...
Installed StateVar-1.1.0.4
Installed text-1.2.2.1
Configuring OpenGLRaw-3.2.4.0...
Building OpenGLRaw-3.2.4.0...
Installed OpenGLRaw-3.2.4.0
Configuring GLURaw-2.0.0.3...
Building GLURaw-2.0.0.3...
Installed GLURaw-2.0.0.3
Configuring OpenGL-3.0.1.0...
Building OpenGL-3.0.1.0...
Installed OpenGL-3.0.1.0
Configuring GLUT-2.7.0.10...
Building GLUT-2.7.0.10...
Installed GLUT-2.7.0.10
cabal: Error: some packages failed to install:
Raincat-1.1.1.2 depends on SDL-image-0.6.1.2 which failed to install.
SDL-image-0.6.1.2 failed during the configure step. The exception was:
ExitFailure 77
SDL-mixer-0.6.2.0 failed during the configure step. The exception was:
ExitFailure 77