Build #1 for fltkhs-fluid-examples-0.0.0.3

[all reports]

Package fltkhs-fluid-examples-0.0.0.3
Install DependencyFailed fltkhs-0.4.0.0
Docs NotTried
Tests NotTried
Time submitted 2016-01-19 20:33:13.218116 UTC
Compiler ghc-7.10.2
OS linux
Arch x86_64
Dependencies fltkhs-0.4.0.0, bytestring-0.10.6.0, base-4.8.1.0
Flags fastcompile

Build log

[view raw]

Resolving dependencies...
Configuring mtl-2.2.1...
Building mtl-2.2.1...
Preprocessing library mtl-2.2.1...
[ 1 of 22] Compiling Control.Monad.Writer.Class ( Control/Monad/Writer/Class.hs, dist/build/Control/Monad/Writer/Class.o )
[ 2 of 22] Compiling Control.Monad.State.Class ( Control/Monad/State/Class.hs, dist/build/Control/Monad/State/Class.o )
[ 3 of 22] Compiling Control.Monad.Reader.Class ( Control/Monad/Reader/Class.hs, dist/build/Control/Monad/Reader/Class.o )
[ 4 of 22] Compiling Control.Monad.RWS.Class ( Control/Monad/RWS/Class.hs, dist/build/Control/Monad/RWS/Class.o )
[ 5 of 22] Compiling Control.Monad.Identity ( Control/Monad/Identity.hs, dist/build/Control/Monad/Identity.o )
[ 6 of 22] Compiling Control.Monad.Error.Class ( Control/Monad/Error/Class.hs, dist/build/Control/Monad/Error/Class.o )
[ 7 of 22] Compiling Control.Monad.Cont.Class ( Control/Monad/Cont/Class.hs, dist/build/Control/Monad/Cont/Class.o )
[ 8 of 22] Compiling Control.Monad.Trans ( Control/Monad/Trans.hs, dist/build/Control/Monad/Trans.o )
[ 9 of 22] Compiling Control.Monad.Error ( Control/Monad/Error.hs, dist/build/Control/Monad/Error.o )
[10 of 22] Compiling Control.Monad.Except ( Control/Monad/Except.hs, dist/build/Control/Monad/Except.o )
[11 of 22] Compiling Control.Monad.List ( Control/Monad/List.hs, dist/build/Control/Monad/List.o )
[12 of 22] Compiling Control.Monad.RWS.Lazy ( Control/Monad/RWS/Lazy.hs, dist/build/Control/Monad/RWS/Lazy.o )
[13 of 22] Compiling Control.Monad.RWS ( Control/Monad/RWS.hs, dist/build/Control/Monad/RWS.o )
[14 of 22] Compiling Control.Monad.Reader ( Control/Monad/Reader.hs, dist/build/Control/Monad/Reader.o )
[15 of 22] Compiling Control.Monad.RWS.Strict ( Control/Monad/RWS/Strict.hs, dist/build/Control/Monad/RWS/Strict.o )
[16 of 22] Compiling Control.Monad.State.Lazy ( Control/Monad/State/Lazy.hs, dist/build/Control/Monad/State/Lazy.o )
[17 of 22] Compiling Control.Monad.State ( Control/Monad/State.hs, dist/build/Control/Monad/State.o )
[18 of 22] Compiling Control.Monad.State.Strict ( Control/Monad/State/Strict.hs, dist/build/Control/Monad/State/Strict.o )
[19 of 22] Compiling Control.Monad.Writer.Lazy ( Control/Monad/Writer/Lazy.hs, dist/build/Control/Monad/Writer/Lazy.o )
[20 of 22] Compiling Control.Monad.Writer ( Control/Monad/Writer.hs, dist/build/Control/Monad/Writer.o )
[21 of 22] Compiling Control.Monad.Writer.Strict ( Control/Monad/Writer/Strict.hs, dist/build/Control/Monad/Writer/Strict.o )
[22 of 22] Compiling Control.Monad.Cont ( Control/Monad/Cont.hs, dist/build/Control/Monad/Cont.o )
In-place registering mtl-2.2.1...
Running Haddock for mtl-2.2.1...
Running hscolour for mtl-2.2.1...
Preprocessing library mtl-2.2.1...
Preprocessing library mtl-2.2.1...
Haddock coverage:
  75% (  3 /  4) in 'Control.Monad.Writer.Class'
  Missing documentation for:
    MonadWriter (Control/Monad/Writer/Class.hs:62)
 100% (  5 /  5) in 'Control.Monad.State.Class'
 100% (  3 /  3) in 'Control.Monad.Reader.Class'
  80% (  4 /  5) in 'Control.Monad.RWS.Class'
  Missing documentation for:
    MonadRWS (Control/Monad/RWS/Class.hs:44)
 100% (  4 /  4) in 'Control.Monad.Identity'
 100% (  3 /  3) in 'Control.Monad.Error.Class'
  50% (  1 /  2) in 'Control.Monad.Cont.Class'
  Missing documentation for:
    MonadCont (Control/Monad/Cont/Class.hs:73)
 100% (  3 /  3) in 'Control.Monad.Trans'
  93% ( 14 / 15) in 'Control.Monad.Error'
  Missing documentation for:
    runErrorT
 100% ( 19 / 19) in 'Control.Monad.Except'
 100% (  5 /  5) in 'Control.Monad.List'
  95% ( 21 / 22) in 'Control.Monad.RWS.Lazy'
  Missing documentation for:
    runRWST
 100% (  2 /  2) in 'Control.Monad.RWS'
  96% ( 22 / 23) in 'Control.Monad.Reader'
  Missing documentation for:
    runReaderT
  95% ( 21 / 22) in 'Control.Monad.RWS.Strict'
  Missing documentation for:
    runRWST
  96% ( 24 / 25) in 'Control.Monad.State.Lazy'
  Missing documentation for:
    runStateT
 100% (  2 /  2) in 'Control.Monad.State'
  96% ( 24 / 25) in 'Control.Monad.State.Strict'
  Missing documentation for:
    runStateT
  89% ( 17 / 19) in 'Control.Monad.Writer.Lazy'
  Missing documentation for:
    MonadWriter (Control/Monad/Writer/Class.hs:62)
    runWriterT
 100% (  2 /  2) in 'Control.Monad.Writer'
  94% ( 17 / 18) in 'Control.Monad.Writer.Strict'
  Missing documentation for:
    MonadWriter (Control/Monad/Writer/Class.hs:62)
  91% ( 20 / 22) in 'Control.Monad.Cont'
  Missing documentation for:
    MonadCont (Control/Monad/Cont/Class.hs:73)
    runContT
Documentation created: dist/doc/html/mtl/index.html, dist/doc/html/mtl/mtl.txt
Creating package registration file: /tmp/pkgConf-mtl-2.2278722862233665123.1
Installing library in
/home/builder/hackage-server/build-cache/tmp-install/lib/x86_64-linux-ghc-7.10.2/mtl-2.2.1-KMpng31YRYc5JfMWFZ3FCU
Registering mtl-2.2.1...
Installed mtl-2.2.1
Configuring text-1.2.2.0...
Building text-1.2.2.0...
Preprocessing library text-1.2.2.0...
[ 1 of 44] Compiling Data.Text.Internal.Read ( Data/Text/Internal/Read.hs, dist/build/Data/Text/Internal/Read.o )
[ 2 of 44] Compiling Data.Text.Internal.Encoding.Utf32 ( Data/Text/Internal/Encoding/Utf32.hs, dist/build/Data/Text/Internal/Encoding/Utf32.o )
[ 3 of 44] Compiling Data.Text.Internal.Builder.RealFloat.Functions ( Data/Text/Internal/Builder/RealFloat/Functions.hs, dist/build/Data/Text/Internal/Builder/RealFloat/Functions.o )
[ 4 of 44] Compiling Data.Text.Internal.Builder.Int.Digits ( Data/Text/Internal/Builder/Int/Digits.hs, dist/build/Data/Text/Internal/Builder/Int/Digits.o )
[ 5 of 44] Compiling Data.Text.Encoding.Error ( Data/Text/Encoding/Error.hs, dist/build/Data/Text/Encoding/Error.o )
[ 6 of 44] Compiling Data.Text.Internal.Unsafe.Shift ( Data/Text/Internal/Unsafe/Shift.hs, dist/build/Data/Text/Internal/Unsafe/Shift.o )
[ 7 of 44] Compiling Data.Text.Internal.Encoding.Utf16 ( Data/Text/Internal/Encoding/Utf16.hs, dist/build/Data/Text/Internal/Encoding/Utf16.o )
[ 8 of 44] Compiling Data.Text.Internal.Functions ( Data/Text/Internal/Functions.hs, dist/build/Data/Text/Internal/Functions.o )
[ 9 of 44] Compiling Data.Text.Internal.Unsafe ( Data/Text/Internal/Unsafe.hs, dist/build/Data/Text/Internal/Unsafe.o )
[10 of 44] Compiling Data.Text.Array  ( Data/Text/Array.hs, dist/build/Data/Text/Array.o )
[11 of 44] Compiling Data.Text.Internal.Unsafe.Char ( Data/Text/Internal/Unsafe/Char.hs, dist/build/Data/Text/Internal/Unsafe/Char.o )
[12 of 44] Compiling Data.Text.Internal ( Data/Text/Internal.hs, dist/build/Data/Text/Internal.o )
[13 of 44] Compiling Data.Text.Internal.Fusion.Size ( Data/Text/Internal/Fusion/Size.hs, dist/build/Data/Text/Internal/Fusion/Size.o )
[14 of 44] Compiling Data.Text.Internal.Fusion.Types ( Data/Text/Internal/Fusion/Types.hs, dist/build/Data/Text/Internal/Fusion/Types.o )
[15 of 44] Compiling Data.Text.Internal.Fusion.CaseMapping ( Data/Text/Internal/Fusion/CaseMapping.hs, dist/build/Data/Text/Internal/Fusion/CaseMapping.o )
[16 of 44] Compiling Data.Text.Internal.Fusion.Common ( Data/Text/Internal/Fusion/Common.hs, dist/build/Data/Text/Internal/Fusion/Common.o )
[17 of 44] Compiling Data.Text.Unsafe ( Data/Text/Unsafe.hs, dist/build/Data/Text/Unsafe.o )
[18 of 44] Compiling Data.Text.Internal.Private ( Data/Text/Internal/Private.hs, dist/build/Data/Text/Internal/Private.o )
[19 of 44] Compiling Data.Text.Internal.Fusion ( Data/Text/Internal/Fusion.hs, dist/build/Data/Text/Internal/Fusion.o )
[20 of 44] Compiling Data.Text.Show   ( Data/Text/Show.hs, dist/build/Data/Text/Show.o )
[21 of 44] Compiling Data.Text.Internal.Encoding.Fusion.Common ( Data/Text/Internal/Encoding/Fusion/Common.hs, dist/build/Data/Text/Internal/Encoding/Fusion/Common.o )
[22 of 44] Compiling Data.Text.Internal.Encoding.Utf8 ( Data/Text/Internal/Encoding/Utf8.hs, dist/build/Data/Text/Internal/Encoding/Utf8.o )
[23 of 44] Compiling Data.Text.Internal.Encoding.Fusion ( Data/Text/Internal/Encoding/Fusion.hs, dist/build/Data/Text/Internal/Encoding/Fusion.o )
[24 of 44] Compiling Data.Text.Encoding ( Data/Text/Encoding.hs, dist/build/Data/Text/Encoding.o )
[25 of 44] Compiling Data.Text.Internal.Lazy.Encoding.Fusion ( Data/Text/Internal/Lazy/Encoding/Fusion.hs, dist/build/Data/Text/Internal/Lazy/Encoding/Fusion.o )
[26 of 44] Compiling Data.Text.Internal.Search ( Data/Text/Internal/Search.hs, dist/build/Data/Text/Internal/Search.o )
[27 of 44] Compiling Data.Text.Foreign ( Data/Text/Foreign.hs, dist/build/Data/Text/Foreign.o )
[28 of 44] Compiling Data.Text        ( Data/Text.hs, dist/build/Data/Text.o )
[29 of 44] Compiling Data.Text.Internal.IO ( Data/Text/Internal/IO.hs, dist/build/Data/Text/Internal/IO.o )
[30 of 44] Compiling Data.Text.IO     ( Data/Text/IO.hs, dist/build/Data/Text/IO.o )
[31 of 44] Compiling Data.Text.Internal.Lazy ( Data/Text/Internal/Lazy.hs, dist/build/Data/Text/Internal/Lazy.o )
[32 of 44] Compiling Data.Text.Internal.Lazy.Fusion ( Data/Text/Internal/Lazy/Fusion.hs, dist/build/Data/Text/Internal/Lazy/Fusion.o )
[33 of 44] Compiling Data.Text.Internal.Lazy.Search ( Data/Text/Internal/Lazy/Search.hs, dist/build/Data/Text/Internal/Lazy/Search.o )
[34 of 44] Compiling Data.Text.Lazy.Internal ( Data/Text/Lazy/Internal.hs, dist/build/Data/Text/Lazy/Internal.o )
[35 of 44] Compiling Data.Text.Lazy.Encoding ( Data/Text/Lazy/Encoding.hs, dist/build/Data/Text/Lazy/Encoding.o )
[36 of 44] Compiling Data.Text.Lazy   ( Data/Text/Lazy.hs, dist/build/Data/Text/Lazy.o )
[37 of 44] Compiling Data.Text.Internal.Builder ( Data/Text/Internal/Builder.hs, dist/build/Data/Text/Internal/Builder.o )
[38 of 44] Compiling Data.Text.Lazy.Builder ( Data/Text/Lazy/Builder.hs, dist/build/Data/Text/Lazy/Builder.o )
[39 of 44] Compiling Data.Text.Internal.Builder.Functions ( Data/Text/Internal/Builder/Functions.hs, dist/build/Data/Text/Internal/Builder/Functions.o )
[40 of 44] Compiling Data.Text.Lazy.Builder.Int ( Data/Text/Lazy/Builder/Int.hs, dist/build/Data/Text/Lazy/Builder/Int.o )
[41 of 44] Compiling Data.Text.Lazy.IO ( Data/Text/Lazy/IO.hs, dist/build/Data/Text/Lazy/IO.o )
[42 of 44] Compiling Data.Text.Lazy.Read ( Data/Text/Lazy/Read.hs, dist/build/Data/Text/Lazy/Read.o )
[43 of 44] Compiling Data.Text.Lazy.Builder.RealFloat ( Data/Text/Lazy/Builder/RealFloat.hs, dist/build/Data/Text/Lazy/Builder/RealFloat.o )
[44 of 44] Compiling Data.Text.Read   ( Data/Text/Read.hs, dist/build/Data/Text/Read.o )
In-place registering text-1.2.2.0...
Running Haddock for text-1.2.2.0...
Running hscolour for text-1.2.2.0...
Preprocessing library text-1.2.2.0...
Preprocessing library text-1.2.2.0...
Haddock coverage:
  14% (  1 /  7) in 'Data.Text.Internal.Read'
  Missing documentation for:
    IReader (Data/Text/Internal/Read.hs:26)
    IParser (Data/Text/Internal/Read.hs:28)
    T (Data/Text/Internal/Read.hs:48)
    digitToInt (Data/Text/Internal/Read.hs:61)
    hexDigitToInt (Data/Text/Internal/Read.hs:55)
    perhaps (Data/Text/Internal/Read.hs:50)
  50% (  1 /  2) in 'Data.Text.Internal.Encoding.Utf32'
  Missing documentation for:
    validate (Data/Text/Internal/Encoding/Utf32.hs:24)
  50% (  1 /  2) in 'Data.Text.Internal.Builder.RealFloat.Functions'
  Missing documentation for:
    roundTo (Data/Text/Internal/Builder/RealFloat/Functions.hs:17)
   0% (  0 /  2) in 'Data.Text.Internal.Builder.Int.Digits'
  Missing documentation for:
    Module header
    digits (Data/Text/Internal/Builder/Int/Digits.hs:21)
 100% ( 12 / 12) in 'Data.Text.Encoding.Error'
 100% (  2 /  2) in 'Data.Text.Internal.Unsafe.Shift'
  25% (  1 /  4) in 'Data.Text.Internal.Encoding.Utf16'
  Missing documentation for:
    chr2 (Data/Text/Internal/Encoding/Utf16.hs:29)
    validate1 (Data/Text/Internal/Encoding/Utf16.hs:38)
    validate2 (Data/Text/Internal/Encoding/Utf16.hs:42)
 100% (  2 /  2) in 'Data.Text.Internal.Functions'
 100% (  3 /  3) in 'Data.Text.Internal.Unsafe'
 100% ( 16 / 16) in 'Data.Text.Array'
  33% (  2 /  6) in 'Data.Text.Internal.Unsafe.Char'
  Missing documentation for:
    ord (Data/Text/Internal/Unsafe/Char.hs:39)
    unsafeChr (Data/Text/Internal/Unsafe/Char.hs:43)
    unsafeChr8 (Data/Text/Internal/Unsafe/Char.hs:47)
    unsafeChr32 (Data/Text/Internal/Unsafe/Char.hs:51)
  95% ( 19 / 20) in 'Data.Text.Internal'
  Missing documentation for:
    textP (Data/Text/Internal.hs:97)
  38% (  5 / 13) in 'Data.Text.Internal.Fusion.Size'
  Missing documentation for:
    Size (Data/Text/Internal/Fusion/Size.hs:40)
    exactly (Data/Text/Internal/Fusion/Size.hs:44)
    exactSize (Data/Text/Internal/Fusion/Size.hs:49)
    maxSize (Data/Text/Internal/Fusion/Size.hs:57)
    betweenSize (Data/Text/Internal/Fusion/Size.hs:65)
    unknownSize (Data/Text/Internal/Fusion/Size.hs:74)
    compareSize (Data/Text/Internal/Fusion/Size.hs:143)
    isEmpty (Data/Text/Internal/Fusion/Size.hs:151)
  88% (  7 /  8) in 'Data.Text.Internal.Fusion.Types'
  Missing documentation for:
    Stream (Data/Text/Internal/Fusion/Types.hs:83)
   0% (  0 /  5) in 'Data.Text.Internal.Fusion.CaseMapping'
  Missing documentation for:
    Module header
    upperMapping (Data/Text/Internal/Fusion/CaseMapping.hs:13)
    lowerMapping (Data/Text/Internal/Fusion/CaseMapping.hs:220)
    titleMapping (Data/Text/Internal/Fusion/CaseMapping.hs:225)
    foldMapping (Data/Text/Internal/Fusion/CaseMapping.hs:324)
  89% ( 63 / 71) in 'Data.Text.Internal.Fusion.Common'
  Missing documentation for:
    singleton (Data/Text/Internal/Fusion/Common.hs:119)
    streamList (Data/Text/Internal/Fusion/Common.hs:125)
    unstreamList (Data/Text/Internal/Fusion/Common.hs:131)
    intercalate (Data/Text/Internal/Fusion/Common.hs:577)
    justifyLeftI (Data/Text/Internal/Fusion/Common.hs:479)
    scanl (Data/Text/Internal/Fusion/Common.hs:656)
    replicateCharI (Data/Text/Internal/Fusion/Common.hs:671)
    replicateI (Data/Text/Internal/Fusion/Common.hs:682)
  93% ( 13 / 14) in 'Data.Text.Unsafe'
  Missing documentation for:
    Iter (Data/Text/Unsafe.hs:62)
  33% (  1 /  3) in 'Data.Text.Internal.Private'
  Missing documentation for:
    runText (Data/Text/Internal/Private.hs:33)
    span_ (Data/Text/Internal/Private.hs:23)
  91% ( 20 / 22) in 'Data.Text.Internal.Fusion'
  Missing documentation for:
    Stream (Data/Text/Internal/Fusion/Types.hs:83)
    length (Data/Text/Internal/Fusion.hs:127)
 100% (  4 /  4) in 'Data.Text.Show'
  33% (  2 /  6) in 'Data.Text.Internal.Encoding.Fusion.Common'
  Missing documentation for:
    restreamUtf16LE (Data/Text/Internal/Encoding/Fusion/Common.hs:63)
    restreamUtf16BE (Data/Text/Internal/Encoding/Fusion/Common.hs:39)
    restreamUtf32LE (Data/Text/Internal/Encoding/Fusion/Common.hs:106)
    restreamUtf32BE (Data/Text/Internal/Encoding/Fusion/Common.hs:87)
  17% (  2 / 12) in 'Data.Text.Internal.Encoding.Utf8'
  Missing documentation for:
    ord2 (Data/Text/Internal/Encoding/Utf8.hs:58)
    ord3 (Data/Text/Internal/Encoding/Utf8.hs:69)
    ord4 (Data/Text/Internal/Encoding/Utf8.hs:81)
    chr2 (Data/Text/Internal/Encoding/Utf8.hs:94)
    chr3 (Data/Text/Internal/Encoding/Utf8.hs:103)
    chr4 (Data/Text/Internal/Encoding/Utf8.hs:114)
    validate1 (Data/Text/Internal/Encoding/Utf8.hs:128)
    validate2 (Data/Text/Internal/Encoding/Utf8.hs:132)
    validate3 (Data/Text/Internal/Encoding/Utf8.hs:136)
    validate4 (Data/Text/Internal/Encoding/Utf8.hs:153)
  91% ( 10 / 11) in 'Data.Text.Internal.Encoding.Fusion'
  Missing documentation for:
    streamASCII (Data/Text/Internal/Encoding/Fusion.hs:57)
 100% ( 33 / 33) in 'Data.Text.Encoding'
 100% ( 10 / 10) in 'Data.Text.Internal.Lazy.Encoding.Fusion'
 100% (  2 /  2) in 'Data.Text.Internal.Search'
 100% ( 18 / 18) in 'Data.Text.Foreign'
 100% (127 /127) in 'Data.Text'
 100% (  3 /  3) in 'Data.Text.Internal.IO'
 100% ( 20 / 20) in 'Data.Text.IO'
  93% ( 14 / 15) in 'Data.Text.Internal.Lazy'
  Missing documentation for:
    Text (Data/Text/Internal/Lazy.hs:47)
 100% (  8 /  8) in 'Data.Text.Internal.Lazy.Fusion'
 100% (  2 /  2) in 'Data.Text.Internal.Lazy.Search'
 100% (  2 /  2) in 'Data.Text.Lazy.Internal'
  89% ( 24 / 27) in 'Data.Text.Lazy.Encoding'
  Missing documentation for:
    encodeUtf8 (Data/Text/Lazy/Encoding.hs:148)
    encodeUtf8Builder (Data/Text/Lazy/Encoding.hs:162)
    encodeUtf8BuilderEscaped (Data/Text/Lazy/Encoding.hs:167)
  99% (128 /129) in 'Data.Text.Lazy'
  Missing documentation for:
    Text (Data/Text/Internal/Lazy.hs:47)
  94% ( 16 / 17) in 'Data.Text.Internal.Builder'
  Missing documentation for:
    append' (Data/Text/Internal/Builder.hs:301)
 100% ( 12 / 12) in 'Data.Text.Lazy.Builder'
 100% (  3 /  3) in 'Data.Text.Internal.Builder.Functions'
   0% (  0 /  3) in 'Data.Text.Lazy.Builder.Int'
  Missing documentation for:
    Module header
    decimal (Data/Text/Lazy/Builder/Int.hs:52)
    hexadecimal (Data/Text/Lazy/Builder/Int.hs:162)
 100% ( 19 / 19) in 'Data.Text.Lazy.IO'
 100% (  7 /  7) in 'Data.Text.Lazy.Read'
  75% (  3 /  4) in 'Data.Text.Lazy.Builder.RealFloat'
  Missing documentation for:
    formatRealFloat (Data/Text/Lazy/Builder/RealFloat.hs:46)
 100% (  7 /  7) in 'Data.Text.Read'
Warning: Data.Text.Internal.Fusion.Common: could not find link destinations for:
    findIndicesI
Warning: Data.Text.Unsafe: could not find link destinations for:
    bracket
Warning: Data.Text: could not find link destinations for:
    replicateChar countChar
Warning: Data.Text.Internal.IO: could not find link destinations for:
    Handle__
Warning: Data.Text.Lazy: could not find link destinations for:
    replicateChar dropWords splitAtWord countChar
Warning: Data.Text.Internal.Builder: could not find link destinations for:
    empty append
Warning: Data.Text.Lazy.Builder.RealFloat: could not find link destinations for:
    floatToDigits
Documentation created: dist/doc/html/text/index.html,
dist/doc/html/text/text.txt
Creating package registration file:
/tmp/pkgConf-text-1.2.2711645630195740084.0
Installing library in
/home/builder/hackage-server/build-cache/tmp-install/lib/x86_64-linux-ghc-7.10.2/text-1.2.2.0-BKzOMwCPkuv5n8xwLM3CQG
Registering text-1.2.2.0...
Installed text-1.2.2.0
Configuring parsec-3.1.9...
Building parsec-3.1.9...
Preprocessing library parsec-3.1.9...
[ 1 of 25] Compiling Text.Parsec.Pos  ( Text/Parsec/Pos.hs, dist/build/Text/Parsec/Pos.o )
[ 2 of 25] Compiling Text.Parsec.Error ( Text/Parsec/Error.hs, dist/build/Text/Parsec/Error.o )
[ 3 of 25] Compiling Text.ParserCombinators.Parsec.Error ( Text/ParserCombinators/Parsec/Error.hs, dist/build/Text/ParserCombinators/Parsec/Error.o )
[ 4 of 25] Compiling Text.Parsec.Prim ( Text/Parsec/Prim.hs, dist/build/Text/Parsec/Prim.o )
[ 5 of 25] Compiling Text.Parsec.Combinator ( Text/Parsec/Combinator.hs, dist/build/Text/Parsec/Combinator.o )
[ 6 of 25] Compiling Text.ParserCombinators.Parsec.Combinator ( Text/ParserCombinators/Parsec/Combinator.hs, dist/build/Text/ParserCombinators/Parsec/Combinator.o )
[ 7 of 25] Compiling Text.Parsec.String ( Text/Parsec/String.hs, dist/build/Text/Parsec/String.o )
[ 8 of 25] Compiling Text.Parsec.ByteString ( Text/Parsec/ByteString.hs, dist/build/Text/Parsec/ByteString.o )
[ 9 of 25] Compiling Text.Parsec.ByteString.Lazy ( Text/Parsec/ByteString/Lazy.hs, dist/build/Text/Parsec/ByteString/Lazy.o )
[10 of 25] Compiling Text.Parsec.Text ( Text/Parsec/Text.hs, dist/build/Text/Parsec/Text.o )
[11 of 25] Compiling Text.Parsec.Text.Lazy ( Text/Parsec/Text/Lazy.hs, dist/build/Text/Parsec/Text/Lazy.o )
[12 of 25] Compiling Text.Parsec.Expr ( Text/Parsec/Expr.hs, dist/build/Text/Parsec/Expr.o )
[13 of 25] Compiling Text.ParserCombinators.Parsec.Prim ( Text/ParserCombinators/Parsec/Prim.hs, dist/build/Text/ParserCombinators/Parsec/Prim.o )
[14 of 25] Compiling Text.ParserCombinators.Parsec.Pos ( Text/ParserCombinators/Parsec/Pos.hs, dist/build/Text/ParserCombinators/Parsec/Pos.o )
[15 of 25] Compiling Text.Parsec.Char ( Text/Parsec/Char.hs, dist/build/Text/Parsec/Char.o )
[16 of 25] Compiling Text.Parsec.Token ( Text/Parsec/Token.hs, dist/build/Text/Parsec/Token.o )
[17 of 25] Compiling Text.ParserCombinators.Parsec.Token ( Text/ParserCombinators/Parsec/Token.hs, dist/build/Text/ParserCombinators/Parsec/Token.o )
[18 of 25] Compiling Text.ParserCombinators.Parsec.Char ( Text/ParserCombinators/Parsec/Char.hs, dist/build/Text/ParserCombinators/Parsec/Char.o )
[19 of 25] Compiling Text.ParserCombinators.Parsec ( Text/ParserCombinators/Parsec.hs, dist/build/Text/ParserCombinators/Parsec.o )
[20 of 25] Compiling Text.ParserCombinators.Parsec.Expr ( Text/ParserCombinators/Parsec/Expr.hs, dist/build/Text/ParserCombinators/Parsec/Expr.o )
[21 of 25] Compiling Text.Parsec      ( Text/Parsec.hs, dist/build/Text/Parsec.o )
[22 of 25] Compiling Text.Parsec.Language ( Text/Parsec/Language.hs, dist/build/Text/Parsec/Language.o )

Text/Parsec/Language.hs:44:30: Warning: Tab character

Text/Parsec/Language.hs:45:26: Warning: Tab character

Text/Parsec/Language.hs:46:27: Warning: Tab character

Text/Parsec/Language.hs:58:1: Warning: Tab character

Text/Parsec/Language.hs:58:31: Warning: Tab character

Text/Parsec/Language.hs:59:1: Warning: Tab character

Text/Parsec/Language.hs:59:29: Warning: Tab character

Text/Parsec/Language.hs:60:1: Warning: Tab character

Text/Parsec/Language.hs:60:30: Warning: Tab character

Text/Parsec/Language.hs:61:1: Warning: Tab character

Text/Parsec/Language.hs:62:1: Warning: Tab character

Text/Parsec/Language.hs:62:29: Warning: Tab character

Text/Parsec/Language.hs:63:1: Warning: Tab character

Text/Parsec/Language.hs:63:30: Warning: Tab character

Text/Parsec/Language.hs:64:1: Warning: Tab character

Text/Parsec/Language.hs:65:1: Warning: Tab character

Text/Parsec/Language.hs:67:1: Warning: Tab character

Text/Parsec/Language.hs:109:1: Warning: Tab character

Text/Parsec/Language.hs:109:30: Warning: Tab character

Text/Parsec/Language.hs:110:1: Warning: Tab character

Text/Parsec/Language.hs:110:32: Warning: Tab character

Text/Parsec/Language.hs:111:5: Warning: Tab character

Text/Parsec/Language.hs:112:5: Warning: Tab character

Text/Parsec/Language.hs:113:5: Warning: Tab character

Text/Parsec/Language.hs:114:5: Warning: Tab character

Text/Parsec/Language.hs:146:1: Warning: Tab character

Text/Parsec/Language.hs:147:1: Warning: Tab character

Text/Parsec/Language.hs:148:1: Warning: Tab character

Text/Parsec/Language.hs:150:1: Warning: Tab character
[23 of 25] Compiling Text.ParserCombinators.Parsec.Language ( Text/ParserCombinators/Parsec/Language.hs, dist/build/Text/ParserCombinators/Parsec/Language.o )
[24 of 25] Compiling Text.Parsec.Perm ( Text/Parsec/Perm.hs, dist/build/Text/Parsec/Perm.o )
[25 of 25] Compiling Text.ParserCombinators.Parsec.Perm ( Text/ParserCombinators/Parsec/Perm.hs, dist/build/Text/ParserCombinators/Parsec/Perm.o )
In-place registering parsec-3.1.9...
Running Haddock for parsec-3.1.9...
Running hscolour for parsec-3.1.9...
Preprocessing library parsec-3.1.9...
Preprocessing library parsec-3.1.9...

Text/Parsec/Language.hs:44:30: Warning: Tab character

Text/Parsec/Language.hs:45:26: Warning: Tab character

Text/Parsec/Language.hs:46:27: Warning: Tab character

Text/Parsec/Language.hs:58:1: Warning: Tab character

Text/Parsec/Language.hs:58:31: Warning: Tab character

Text/Parsec/Language.hs:59:1: Warning: Tab character

Text/Parsec/Language.hs:59:29: Warning: Tab character

Text/Parsec/Language.hs:60:1: Warning: Tab character

Text/Parsec/Language.hs:60:30: Warning: Tab character

Text/Parsec/Language.hs:61:1: Warning: Tab character

Text/Parsec/Language.hs:62:1: Warning: Tab character

Text/Parsec/Language.hs:62:29: Warning: Tab character

Text/Parsec/Language.hs:63:1: Warning: Tab character

Text/Parsec/Language.hs:63:30: Warning: Tab character

Text/Parsec/Language.hs:64:1: Warning: Tab character

Text/Parsec/Language.hs:65:1: Warning: Tab character

Text/Parsec/Language.hs:67:1: Warning: Tab character

Text/Parsec/Language.hs:109:1: Warning: Tab character

Text/Parsec/Language.hs:109:30: Warning: Tab character

Text/Parsec/Language.hs:110:1: Warning: Tab character

Text/Parsec/Language.hs:110:32: Warning: Tab character

Text/Parsec/Language.hs:111:5: Warning: Tab character

Text/Parsec/Language.hs:112:5: Warning: Tab character

Text/Parsec/Language.hs:113:5: Warning: Tab character

Text/Parsec/Language.hs:114:5: Warning: Tab character

Text/Parsec/Language.hs:146:1: Warning: Tab character

Text/Parsec/Language.hs:147:1: Warning: Tab character

Text/Parsec/Language.hs:148:1: Warning: Tab character

Text/Parsec/Language.hs:150:1: Warning: Tab character
Haddock coverage:
  82% ( 14 / 17) in 'Text.Parsec.Pos'
  Missing documentation for:
    SourceName (Text/Parsec/Pos.hs:35)
    Line (Text/Parsec/Pos.hs:36)
    Column (Text/Parsec/Pos.hs:37)
  43% (  6 / 14) in 'Text.Parsec.Error'
  Missing documentation for:
    errorIsUnknown (Text/Parsec/Error.hs:110)
    showErrorMessages (Text/Parsec/Error.hs:173)
    newErrorMessage (Text/Parsec/Error.hs:120)
    newErrorUnknown (Text/Parsec/Error.hs:116)
    addErrorMessage (Text/Parsec/Error.hs:124)
    setErrorPos (Text/Parsec/Error.hs:128)
    setErrorMessage (Text/Parsec/Error.hs:132)
    mergeError (Text/Parsec/Error.hs:136)
  38% (  6 / 16) in 'Text.ParserCombinators.Parsec.Error'
  Missing documentation for:
    messageCompare (Text/ParserCombinators/Parsec/Error.hs:36)
    messageEq (Text/ParserCombinators/Parsec/Error.hs:39)
    errorIsUnknown (Text/Parsec/Error.hs:110)
    showErrorMessages (Text/Parsec/Error.hs:173)
    newErrorMessage (Text/Parsec/Error.hs:120)
    newErrorUnknown (Text/Parsec/Error.hs:116)
    addErrorMessage (Text/Parsec/Error.hs:124)
    setErrorPos (Text/Parsec/Error.hs:128)
    setErrorMessage (Text/Parsec/Error.hs:132)
    mergeError (Text/Parsec/Error.hs:136)
  64% ( 32 / 50) in 'Text.Parsec.Prim'
  Missing documentation for:
    unknownError (Text/Parsec/Prim.hs:91)
    sysUnExpectError (Text/Parsec/Prim.hs:94)
    Parsec (Text/Parsec/Prim.hs:152)
    Consumed (Text/Parsec/Prim.hs:154)
    Reply (Text/Parsec/Prim.hs:157)
    State (Text/Parsec/Prim.hs:160)
    parsecMap (Text/Parsec/Prim.hs:177)
    parserReturn (Text/Parsec/Prim.hs:221)
    parserBind (Text/Parsec/Prim.hs:226)
    mergeErrorReply (Text/Parsec/Prim.hs:266)
    parserFail (Text/Parsec/Prim.hs:272)
    parserPlus (Text/Parsec/Prim.hs:290)
    labels (Text/Parsec/Prim.hs:345)
    tokens (Text/Parsec/Prim.hs:396)
    tokenPrimEx (Text/Parsec/Prim.hs:533)
    manyAccum (Text/Parsec/Prim.hs:592)
    runPT (Text/Parsec/Prim.hs:610)
    runP (Text/Parsec/Prim.hs:624)
 100% ( 24 / 24) in 'Text.Parsec.Combinator'
 100% ( 24 / 24) in 'Text.ParserCombinators.Parsec.Combinator'
  50% (  2 /  4) in 'Text.Parsec.String'
  Missing documentation for:
    Parser (Text/Parsec/String.hs:22)
    GenParser (Text/Parsec/String.hs:23)
  50% (  2 /  4) in 'Text.Parsec.ByteString'
  Missing documentation for:
    Parser (Text/Parsec/ByteString.hs:24)
    GenParser (Text/Parsec/ByteString.hs:25)
  50% (  2 /  4) in 'Text.Parsec.ByteString.Lazy'
  Missing documentation for:
    Parser (Text/Parsec/ByteString/Lazy.hs:24)
    GenParser (Text/Parsec/ByteString/Lazy.hs:25)
  33% (  1 /  3) in 'Text.Parsec.Text'
  Missing documentation for:
    Parser (Text/Parsec/Text.hs:23)
    GenParser (Text/Parsec/Text.hs:24)
  33% (  1 /  3) in 'Text.Parsec.Text.Lazy'
  Missing documentation for:
    Parser (Text/Parsec/Text/Lazy.hs:23)
    GenParser (Text/Parsec/Text/Lazy.hs:24)
 100% (  5 /  5) in 'Text.Parsec.Expr'
  70% ( 21 / 30) in 'Text.ParserCombinators.Parsec.Prim'
  Missing documentation for:
    Parser (Text/Parsec/String.hs:22)
    GenParser (Text/Parsec/String.hs:23)
    runParser (Text/ParserCombinators/Parsec/Prim.hs:57)
    tokens (Text/Parsec/Prim.hs:396)
    tokenPrimEx (Text/Parsec/Prim.hs:533)
    try (Text/ParserCombinators/Parsec/Prim.hs:64)
    labels (Text/Parsec/Prim.hs:345)
    pzero (Text/ParserCombinators/Parsec/Prim.hs:54)
    State (Text/Parsec/Prim.hs:160)
  82% ( 14 / 17) in 'Text.ParserCombinators.Parsec.Pos'
  Missing documentation for:
    SourceName (Text/Parsec/Pos.hs:35)
    Line (Text/Parsec/Pos.hs:36)
    Column (Text/Parsec/Pos.hs:37)
 100% ( 20 / 20) in 'Text.Parsec.Char'
  67% (  4 /  6) in 'Text.Parsec.Token'
  Missing documentation for:
    LanguageDef (Text/Parsec/Token.hs:38)
    TokenParser (Text/Parsec/Token.hs:106)
  67% (  4 /  6) in 'Text.ParserCombinators.Parsec.Token'
  Missing documentation for:
    LanguageDef (Text/Parsec/Token.hs:38)
    TokenParser (Text/Parsec/Token.hs:106)
  95% ( 18 / 19) in 'Text.ParserCombinators.Parsec.Char'
  Missing documentation for:
    CharParser (Text/ParserCombinators/Parsec/Char.hs:40)
  83% ( 15 / 18) in 'Text.ParserCombinators.Parsec'
  Missing documentation for:
    SourceName (Text/Parsec/Pos.hs:35)
    Line (Text/Parsec/Pos.hs:36)
    Column (Text/Parsec/Pos.hs:37)
  40% (  2 /  5) in 'Text.ParserCombinators.Parsec.Expr'
  Missing documentation for:
    Operator (Text/ParserCombinators/Parsec/Expr.hs:28)
    OperatorTable (Text/ParserCombinators/Parsec/Expr.hs:32)
    buildExpressionParser (Text/ParserCombinators/Parsec/Expr.hs:39)
  78% ( 73 / 94) in 'Text.Parsec'
  Missing documentation for:
    Parsec (Text/Parsec/Prim.hs:152)
    tokens (Text/Parsec/Prim.hs:396)
    labels (Text/Parsec/Prim.hs:345)
    SourceName (Text/Parsec/Pos.hs:35)
    Line (Text/Parsec/Pos.hs:36)
    Column (Text/Parsec/Pos.hs:37)
    manyAccum (Text/Parsec/Prim.hs:592)
    tokenPrimEx (Text/Parsec/Prim.hs:533)
    runPT (Text/Parsec/Prim.hs:610)
    unknownError (Text/Parsec/Prim.hs:91)
    sysUnExpectError (Text/Parsec/Prim.hs:94)
    mergeErrorReply (Text/Parsec/Prim.hs:266)
    runP (Text/Parsec/Prim.hs:624)
    Consumed (Text/Parsec/Prim.hs:154)
    Reply (Text/Parsec/Prim.hs:157)
    State (Text/Parsec/Prim.hs:160)
    parsecMap (Text/Parsec/Prim.hs:177)
    parserReturn (Text/Parsec/Prim.hs:221)
    parserBind (Text/Parsec/Prim.hs:226)
    parserFail (Text/Parsec/Prim.hs:272)
    parserPlus (Text/Parsec/Prim.hs:290)
  80% (  8 / 10) in 'Text.Parsec.Language'
  Missing documentation for:
    emptyDef (Text/Parsec/Language.hs:79)
    LanguageDef (Text/Parsec/Token.hs:38)
  80% (  8 / 10) in 'Text.ParserCombinators.Parsec.Language'
  Missing documentation for:
    emptyDef (Text/Parsec/Language.hs:79)
    LanguageDef (Text/Parsec/Token.hs:38)
 100% (  8 /  8) in 'Text.Parsec.Perm'
 100% (  7 /  7) in 'Text.ParserCombinators.Parsec.Perm'
Documentation created: dist/doc/html/parsec/index.html,
dist/doc/html/parsec/parsec.txt
Creating package registration file:
/tmp/pkgConf-parsec-3.1144276705763299708.9
Installing library in
/home/builder/hackage-server/build-cache/tmp-install/lib/x86_64-linux-ghc-7.10.2/parsec-3.1.9-AqYX0bfDxT5E4cHIEfeJIN
Registering parsec-3.1.9...
Installed parsec-3.1.9
Downloading fltkhs-0.4.0.0...
[1 of 1] Compiling Main             ( /tmp/cabal-tmp-9438/fltkhs-0.4.0.0/dist/setup/setup.hs, /tmp/cabal-tmp-9438/fltkhs-0.4.0.0/dist/setup/Main.o )

/tmp/cabal-tmp-9438/fltkhs-0.4.0.0/dist/setup/setup.hs:39:29: Warning:
    In the use of ‘defaultUserHooks’
    (imported from Distribution.Simple):
    Deprecated: "Use simpleUserHooks or autoconfUserHooks, unless you need Cabal-1.2
             compatibility in which case you must stick with defaultUserHooks"

/tmp/cabal-tmp-9438/fltkhs-0.4.0.0/dist/setup/setup.hs:53:12: Warning:
    In the use of ‘defaultUserHooks’
    (imported from Distribution.Simple):
    Deprecated: "Use simpleUserHooks or autoconfUserHooks, unless you need Cabal-1.2
             compatibility in which case you must stick with defaultUserHooks"

/tmp/cabal-tmp-9438/fltkhs-0.4.0.0/dist/setup/setup.hs:59:1: Warning:
    Tab character

/tmp/cabal-tmp-9438/fltkhs-0.4.0.0/dist/setup/setup.hs:60:1: Warning:
    Tab character

/tmp/cabal-tmp-9438/fltkhs-0.4.0.0/dist/setup/setup.hs:61:1: Warning:
    Tab character

/tmp/cabal-tmp-9438/fltkhs-0.4.0.0/dist/setup/setup.hs:71:13: Warning:
    In the use of ‘defaultUserHooks’
    (imported from Distribution.Simple):
    Deprecated: "Use simpleUserHooks or autoconfUserHooks, unless you need Cabal-1.2
             compatibility in which case you must stick with defaultUserHooks"

/tmp/cabal-tmp-9438/fltkhs-0.4.0.0/dist/setup/setup.hs:98:16: Warning:
    In the use of ‘defaultUserHooks’
    (imported from Distribution.Simple):
    Deprecated: "Use simpleUserHooks or autoconfUserHooks, unless you need Cabal-1.2
             compatibility in which case you must stick with defaultUserHooks"

/tmp/cabal-tmp-9438/fltkhs-0.4.0.0/dist/setup/setup.hs:102:15: Warning:
    In the use of ‘defaultUserHooks’
    (imported from Distribution.Simple):
    Deprecated: "Use simpleUserHooks or autoconfUserHooks, unless you need Cabal-1.2
             compatibility in which case you must stick with defaultUserHooks"

/tmp/cabal-tmp-9438/fltkhs-0.4.0.0/dist/setup/setup.hs:119:13: Warning:
    In the use of ‘defaultUserHooks’
    (imported from Distribution.Simple):
    Deprecated: "Use simpleUserHooks or autoconfUserHooks, unless you need Cabal-1.2
             compatibility in which case you must stick with defaultUserHooks"
Linking /tmp/cabal-tmp-9438/fltkhs-0.4.0.0/dist/setup/setup ...
Running autoconf ...
Warning: defaultUserHooks in Setup script is deprecated.
Configuring fltkhs-0.4.0.0...
configure: WARNING: unrecognized options: --with-hc, --with-gcc
checking for g++... g++
checking whether the C++ compiler works... yes
checking for C++ compiler default output file name... a.out
checking for suffix of executables... 
checking whether we are cross compiling... no
checking for suffix of object files... o
checking whether we are using the GNU C++ compiler... yes
checking whether g++ accepts -g... yes
checking for gcc... gcc
checking whether we are using the GNU C compiler... yes
checking whether gcc accepts -g... yes
checking for gcc option to accept ISO C89... none needed
checking for fltk-config... fltk-config
checking how to run the C preprocessor... gcc -E
checking for grep that handles long lines and -e... /bin/grep
checking for egrep... /bin/grep -E
checking for ANSI C header files... yes
checking for sys/types.h... yes
checking for sys/stat.h... yes
checking for stdlib.h... yes
checking for string.h... yes
checking for memory.h... yes
checking for strings.h... yes
checking for inttypes.h... yes
checking for stdint.h... yes
checking for unistd.h... yes
checking stddef.h usability... yes
checking stddef.h presence... yes
checking for stddef.h... yes
checking for stdint.h... (cached) yes
checking for stdlib.h... (cached) yes
checking for string.h... (cached) yes
checking for unistd.h... (cached) yes
checking for main in -ldl... yes
checking for fl_alphasort in -lfltk... yes
checking for main in -lfltk_gl... yes
checking for main in -lfltk_images... yes
checking for main in -lfltk_cairo... yes
checking for main in -lfltk_forms... yes
checking for size_t... yes
checking for stdlib.h... (cached) yes
checking for GNU libc compatible malloc... yes
checking for select... yes
checking for strdup... yes
checking for strerror... yes
checking for strrchr... yes
checking for strtol... yes
configure: creating ./config.status
config.status: creating Makefile
config.status: creating c-src/Makefile
config.status: creating c-examples/Makefile
config.status: creating fltkhs.buildinfo
configure: WARNING: unrecognized options: --with-hc, --with-gcc
==Compiling C bindings==
*** Compiling Fl_Menu_ButtonC.cpp...
*** Compiling Fl_PositionerC.cpp...
Fl_PositionerC.cpp: In function ‘void* Fl_Positioner_top_window(fl_Positioner)’:
Fl_PositionerC.cpp:268:67: error: ‘class Fl_Positioner’ has no member named ‘top_window’
     return (fl_Window) (static_cast<Fl_Positioner*>(positioner))->top_window();
                                                                   ^
Fl_PositionerC.cpp: In function ‘void* Fl_Positioner_top_window_offset(fl_Positioner, int*, int*)’:
Fl_PositionerC.cpp:271:67: error: ‘class Fl_Positioner’ has no member named ‘top_window_offset’
     return (fl_Window) (static_cast<Fl_Positioner*>(positioner))->top_window_offset(*xoff,*yoff);
                                                                   ^
Fl_PositionerC.cpp: In function ‘void* Fl_Positioner_top_window(fl_Positioner)’:
Fl_PositionerC.cpp:269:3: warning: control reaches end of non-void function [-Wreturn-type]
   }
   ^
Fl_PositionerC.cpp: In function ‘void* Fl_Positioner_top_window_offset(fl_Positioner, int*, int*)’:
Fl_PositionerC.cpp:272:3: warning: control reaches end of non-void function [-Wreturn-type]
   }
   ^
make[1]: *** [Fl_PositionerC.o] Error 1
make: *** [src] Error 2
Failed to install fltkhs-0.4.0.0
cabal: Error: some packages failed to install:
fltkhs-0.4.0.0 failed during the building phase. The exception was:
ExitFailure 2
fltkhs-fluid-examples-0.0.0.3 depends on fltkhs-0.4.0.0 which failed to
install.