Build #8 for gitlib-s3-3.1.0.1

[all reports]

Package gitlib-s3-3.1.0.1
Install BuildFailed
Docs NotTried
Tests NotTried
Time submitted 2016-12-12 00:46:01.825702 UTC
Compiler ghc-8.0.1.20161018
OS linux
Arch x86_64
Dependencies aeson-1.0.2.1, attempt-0.4.0.1, aws-0.14.1, base-4.9.0.0, bifunctors-5.4.1, binary-0.8.3.0, bytestring-0.10.8.1, conduit-1.2.8, conduit-combinators-1.0.8.3, data-default-0.7.1.1, directory-1.2.6.2, exceptions-0.8.3, filepath-1.4.1.0, ghc-prim-0.5.0.0, gitlib-3.1.1, gitlib-libgit2-3.1.1, hlibgit2-0.18.0.15, http-conduit-2.1.11, lens-4.15.1, lifted-base-0.2.3.8, monad-control-1.0.1.0, monad-logger-0.3.20.1, resourcet-1.1.8.1, retry-0.7.4.2, split-0.2.3.1, stm-2.4.4.1, template-haskell-2.11.0.0, text-1.2.2.1, time-1.6.0.1, transformers-0.5.2.0, unordered-containers-0.2.7.1
Flags none

Build log

[view raw]

Resolving dependencies...
Configuring auto-update-0.1.4...
Configuring base-compat-0.9.1...
Building base-compat-0.9.1...
Building auto-update-0.1.4...
Installed auto-update-0.1.4
Configuring base-orphans-0.5.4...
Building base-orphans-0.5.4...
Configuring base16-bytestring-0.1.1.6...
Installed base-compat-0.9.1
Installed base-orphans-0.5.4
Configuring base64-bytestring-1.0.0.1...
Building base16-bytestring-0.1.1.6...
Building base64-bytestring-1.0.0.1...
Installed base16-bytestring-0.1.1.6
Configuring bindings-DSL-1.0.23...
Building bindings-DSL-1.0.23...
Installed base64-bytestring-1.0.0.1
Configuring byteable-0.1.1...
Building byteable-0.1.1...
Installed bindings-DSL-1.0.23
Configuring bytestring-builder-0.10.8.1.0...
Building bytestring-builder-0.10.8.1.0...
Configuring cereal-0.5.4.0...
Installed bytestring-builder-0.10.8.1.0
Configuring data-default-class-0.1.2.0...
Installed byteable-0.1.1
Building cereal-0.5.4.0...
Building data-default-class-0.1.2.0...
Configuring dlist-0.8.0.2...
Installed data-default-class-0.1.2.0
Building dlist-0.8.0.2...
Configuring failure-0.2.0.3...
Installed dlist-0.8.0.2
Building failure-0.2.0.3...
Configuring easy-file-0.2.1...
Installed cereal-0.5.4.0
Building easy-file-0.2.1...
Configuring hourglass-0.2.10...
Installed failure-0.2.0.3
Building hourglass-0.2.10...
Configuring memory-0.13...
Installed easy-file-0.2.1
Building memory-0.13...
Configuring monad-loops-0.4.3...
Installed hourglass-0.2.10
Building monad-loops-0.4.3...
Configuring mtl-2.2.1...
Installed memory-0.13
Building mtl-2.2.1...
Configuring network-2.6.3.1...
Installed monad-loops-0.4.3
Building network-2.6.3.1...
Configuring old-locale-1.0.0.7...
Installed mtl-2.2.1
Building old-locale-1.0.0.7...
Configuring prelude-extras-0.4.0.3...
Installed old-locale-1.0.0.7
Building prelude-extras-0.4.0.3...
Configuring parallel-3.2.1.0...
Installed prelude-extras-0.4.0.3
Building parallel-3.2.1.0...
Configuring primitive-0.6.1.0...
Installed network-2.6.3.1
Building primitive-0.6.1.0...
Configuring random-1.1...
Installed parallel-3.2.1.0
Building random-1.1...
Configuring reflection-2.1.2...
Installed primitive-0.6.1.0
Building reflection-2.1.2...
Configuring safe-0.3.10...
Installed random-1.1
Building safe-0.3.10...
Configuring split-0.2.3.1...
Installed safe-0.3.10
Building split-0.2.3.1...
Configuring stm-2.4.4.1...
Installed split-0.2.3.1
Configuring semigroups-0.18.2...
Installed reflection-2.1.2
Building stm-2.4.4.1...
Building semigroups-0.18.2...
Configuring time-locale-compat-0.1.1.3...
Installed semigroups-0.18.2
Building time-locale-compat-0.1.1.3...
Configuring text-1.2.2.1...
Installed stm-2.4.4.1
Building text-1.2.2.1...
Configuring transformers-compat-0.5.1.4...
Installed time-locale-compat-0.1.1.3
Building transformers-compat-0.5.1.4...
Configuring unix-compat-0.4.3.1...
Installed transformers-compat-0.5.1.4
Building unix-compat-0.4.3.1...
Configuring utf8-string-1.0.1.1...
Installed unix-compat-0.4.3.1
Building utf8-string-1.0.1.1...
Configuring zlib-0.6.1.2...
Installed utf8-string-1.0.1.1
Building zlib-0.6.1.2...
Installed zlib-0.6.1.2
Configuring data-default-instances-containers-0.0.1...
Building data-default-instances-containers-0.0.1...
Installed text-1.2.2.1
Configuring attempt-0.4.0.1...
Configuring data-default-instances-dlist-0.0.1...
Installed data-default-instances-containers-0.0.1
Building attempt-0.4.0.1...
Building data-default-instances-dlist-0.0.1...
Configuring asn1-types-0.3.2...
Installed attempt-0.4.0.1
Configuring pem-0.2.2...
Installed data-default-instances-dlist-0.0.1
Building asn1-types-0.3.2...
Building pem-0.2.2...
Configuring cryptonite-0.20...
Installed pem-0.2.2
Building cryptonite-0.20...
Configuring old-time-1.1.0.3...
Installed asn1-types-0.3.2
Building old-time-1.1.0.3...
Configuring data-default-instances-old-locale-0.0.1...
Installed old-time-1.1.0.3
Building data-default-instances-old-locale-0.0.1...
Configuring socks-0.5.5...
Installed data-default-instances-old-locale-0.0.1
Building socks-0.5.5...
Configuring StateVar-1.1.0.4...
Installed socks-0.5.5
Building StateVar-1.1.0.4...
Configuring vector-0.11.0.0...
Installed StateVar-1.1.0.4
Building vector-0.11.0.0...
Configuring async-2.1.1...
Installed cryptonite-0.20
Building async-2.1.1...
Configuring exceptions-0.8.3...
Installed async-2.1.1
Building exceptions-0.8.3...
Configuring stm-chans-3.0.0.4...
Installed vector-0.11.0.0
Configuring mmorph-1.0.9...
Installed exceptions-0.8.3
Building mmorph-1.0.9...
Building stm-chans-3.0.0.4...
Configuring tagged-0.8.5...
Installed mmorph-1.0.9
Building tagged-0.8.5...
Configuring transformers-base-0.4.4...
Installed stm-chans-3.0.0.4
Building transformers-base-0.4.4...
Installed tagged-0.8.5
Configuring hlibgit2-0.18.0.15...
Installed transformers-base-0.4.4
Configuring blaze-builder-0.4.0.2...
Building blaze-builder-0.4.0.2...
Building hlibgit2-0.18.0.15...
Configuring hashable-1.2.4.0...
Installed blaze-builder-0.4.0.2
Building hashable-1.2.4.0...
Configuring mime-types-0.1.0.7...
Installed hashable-1.2.4.0
Building mime-types-0.1.0.7...
Configuring parsec-3.1.11...
Installed mime-types-0.1.0.7
Building parsec-3.1.11...
Configuring xml-types-0.3.6...
Installed parsec-3.1.11
Building xml-types-0.3.6...
Configuring text-icu-0.7.0.1...
Installed xml-types-0.3.6
Building text-icu-0.7.0.1...
Configuring asn1-encoding-0.9.4...
Installed text-icu-0.7.0.1
Building asn1-encoding-0.9.4...
Configuring data-default-0.7.1.1...
Installed asn1-encoding-0.9.4
Building data-default-0.7.1.1...
Configuring unix-time-0.3.7...
Installed data-default-0.7.1.1
Building unix-time-0.3.7...
Configuring chunked-data-0.3.0...
Installed unix-time-0.3.7
Building chunked-data-0.3.0...
Configuring cryptohash-0.11.9...
Installed chunked-data-0.3.0
Building cryptohash-0.11.9...
Configuring vector-algorithms-0.7.0.1...
Installed cryptohash-0.11.9
Building vector-algorithms-0.7.0.1...
Configuring mwc-random-0.13.5.0...
Installed vector-algorithms-0.7.0.1
Building mwc-random-0.13.5.0...
Configuring retry-0.7.4.2...
Installed hlibgit2-0.18.0.15
Building retry-0.7.4.2...
Configuring distributive-0.5.0.2...
Installed retry-0.7.4.2
Installed mwc-random-0.13.5.0
Configuring monad-control-1.0.1.0...
Building monad-control-1.0.1.0...
Building distributive-0.5.0.2...
Installed monad-control-1.0.1.0
Configuring blaze-markup-0.7.1.1...
Building blaze-markup-0.7.1.1...
Configuring cookie-0.4.2.1...
Installed distributive-0.5.0.2
Building cookie-0.4.2.1...
Configuring streaming-commons-0.1.16...
Installed blaze-markup-0.7.1.1
Building streaming-commons-0.1.16...
Configuring case-insensitive-1.2.0.7...
Installed cookie-0.4.2.1
Building case-insensitive-1.2.0.7...
Configuring scientific-0.3.4.9...
Installed case-insensitive-1.2.0.7
Building scientific-0.3.4.9...
Configuring constraints-0.8...
Installed streaming-commons-0.1.16
Building constraints-0.8...
Configuring unordered-containers-0.2.7.1...
Installed scientific-0.3.4.9
Building unordered-containers-0.2.7.1...
Configuring void-0.7.1...
Installed constraints-0.8
Building void-0.7.1...
Configuring network-uri-2.6.1.0...
Installed void-0.7.1
Building network-uri-2.6.1.0...
Configuring asn1-parse-0.9.4...
Installed unordered-containers-0.2.7.1
Building asn1-parse-0.9.4...
Configuring fast-logger-2.4.7...
Installed asn1-parse-0.9.4
Installed network-uri-2.6.1.0
Configuring lifted-base-0.2.3.8...
Building fast-logger-2.4.7...
Building lifted-base-0.2.3.8...
Installed fast-logger-2.4.7
Configuring http-types-0.9.1...
Configuring blaze-html-0.8.1.3...
Installed lifted-base-0.2.3.8
Building http-types-0.9.1...
Building blaze-html-0.8.1.3...
Configuring contravariant-1.4...
Installed http-types-0.9.1
Building contravariant-1.4...
Configuring mono-traversable-1.0.1...
Installed contravariant-1.4
Building mono-traversable-1.0.1...
Configuring attoparsec-0.13.1.0...
Installed blaze-html-0.8.1.3
Building attoparsec-0.13.1.0...
Configuring x509-1.6.5...
Installed mono-traversable-1.0.1
Building x509-1.6.5...
Installed attoparsec-0.13.1.0
Configuring lifted-async-0.9.0...
Building lifted-async-0.9.0...
Configuring resourcet-1.1.8.1...
Installed lifted-async-0.9.0
Building resourcet-1.1.8.1...
Installed x509-1.6.5
Configuring comonad-5...
Building comonad-5...
Configuring http-client-0.4.31.2...
Installed resourcet-1.1.8.1
Building http-client-0.4.31.2...
Configuring aeson-1.0.2.1...
Installed comonad-5
Building aeson-1.0.2.1...
Installed http-client-0.4.31.2
Configuring x509-store-1.6.2...
Building x509-store-1.6.2...
Installed x509-store-1.6.2
Configuring conduit-1.2.8...
Building conduit-1.2.8...
Installed conduit-1.2.8
Configuring bifunctors-5.4.1...
Building bifunctors-5.4.1...
Configuring x509-system-1.6.4...
Installed aeson-1.0.2.1
Building x509-system-1.6.4...
Configuring x509-validation-1.6.5...
Installed x509-system-1.6.4
Building x509-validation-1.6.5...
Installed bifunctors-5.4.1
Configuring cereal-conduit-0.7.3...
Building cereal-conduit-0.7.3...
Configuring conduit-extra-1.1.15...
Installed x509-validation-1.6.5
Building conduit-extra-1.1.15...
Installed cereal-conduit-0.7.3
Configuring semigroupoids-5.1...
Building semigroupoids-5.1...
Configuring profunctors-5.2...
Installed conduit-extra-1.1.15
Building profunctors-5.2...
Configuring tls-1.3.8...
Installed semigroupoids-5.1
Building tls-1.3.8...
Installed profunctors-5.2
Configuring conduit-combinators-1.0.8.3...
Building conduit-combinators-1.0.8.3...
Installed conduit-combinators-1.0.8.3
Configuring monad-logger-0.3.20.1...
Building monad-logger-0.3.20.1...
Configuring xml-conduit-1.3.5...
Installed tls-1.3.8
Building xml-conduit-1.3.5...
Installed monad-logger-0.3.20.1
Configuring free-4.12.4...
Building free-4.12.4...
Configuring gitlib-3.1.1...
Installed xml-conduit-1.3.5
Building gitlib-3.1.1...
Configuring stm-conduit-3.0.0...
Installed free-4.12.4
Building stm-conduit-3.0.0...
Configuring connection-0.2.6...
Installed gitlib-3.1.1
Building connection-0.2.6...
Installed connection-0.2.6
Configuring adjunctions-4.3...
Configuring http-client-tls-0.2.4.1...
Installed stm-conduit-3.0.0
Building adjunctions-4.3...
Building http-client-tls-0.2.4.1...
Configuring gitlib-libgit2-3.1.1...
Installed http-client-tls-0.2.4.1
Building gitlib-libgit2-3.1.1...
Configuring http-conduit-2.1.11...
Installed adjunctions-4.3
Building http-conduit-2.1.11...
Installed http-conduit-2.1.11
Configuring kan-extensions-5.0.1...
Configuring aws-0.14.1...
Installed gitlib-libgit2-3.1.1
Building kan-extensions-5.0.1...
Building aws-0.14.1...
Installed kan-extensions-5.0.1
Configuring lens-4.15.1...
Building lens-4.15.1...
Installed aws-0.14.1
Installed lens-4.15.1
Configuring gitlib-s3-3.1.0.1...
Building gitlib-s3-3.1.0.1...
Failed to install gitlib-s3-3.1.0.1
Build log ( /home/builder/.cabal/logs/gitlib-s3-3.1.0.1.log ):
cabal: Entering directory '/tmp/cabal-tmp-28034/gitlib-s3-3.1.0.1'
Configuring gitlib-s3-3.1.0.1...
Building gitlib-s3-3.1.0.1...
Preprocessing library gitlib-s3-3.1.0.1...
[1 of 1] Compiling Git.S3           ( Git/S3.hs, dist/build/Git/S3.o )

Git/S3.hs:165:29: error: Not in scope: type variable ‘m’

Git/S3.hs:165:60: error: Not in scope: type variable ‘m’

Git/S3.hs:166:29: error: Not in scope: type variable ‘m’

Git/S3.hs:166:60: error: Not in scope: type variable ‘m’

Git/S3.hs:167:29: error: Not in scope: type variable ‘m’

Git/S3.hs:168:31: error: Not in scope: type variable ‘m’

Git/S3.hs:169:29: error: Not in scope: type variable ‘m’

Git/S3.hs:170:31: error: Not in scope: type variable ‘m’
cabal: Leaving directory '/tmp/cabal-tmp-28034/gitlib-s3-3.1.0.1'
cabal: Error: some packages failed to install:
gitlib-s3-3.1.0.1 failed during the building phase. The exception was:
ExitFailure 1